BDBM50229928 CHEMBL97998
SMILES: [H][C@](N)(CCCCN)C(=O)NCC1CCCCN1C(=O)CCCCCCCCCCCCCC
InChI Key: InChIKey=DASQQWHJTJLXJK-BBMPLOMVSA-N
Data: 1 IC50
Activity Spreadsheet -- Enzyme Inhibition Constant Data from BindingDB
Found 1 hit for monomerid = 50229928
Trg + Lig
Ki
nM
ΔG°
kcal/mole
IC50
nM
Kd
nM
EC50/IC50
nM
koff
s-1
kon
M-1s-1
pHTemp
°C
Protein kinase C, PKC; classical
(Rattus norvegicus (Rat)-Rattus norvegicus (rat))
BDBM50229928
(CHEMBL97998)
Show SMILES [H][C@](N)(CCCCN)C(=O)NCC1CCCCN1C(=O)CCCCCCCCCCCCCC
Show InChI InChI=1S/C27H54N4O2/c1-2-3-4-5-6-7-8-9-10-11-12-13-20-26(32)31-22-17-15-18-24(31)23-30-27(33)25(29)19-14-16-21-28/h24-25H,2-23,28-29H2,1H3,(H,30,33)/t24?,25-/m0/s1
n/an/a 3.80E+4n/an/an/an/an/an/a
Nova Pharmaceutical Corporation
Curated by ChEMBL
Assay Description
Inhibition of PMA and [Ca2+] induced 32P incorporation into histones by partially purified rat brain Protein kinase C
J Med Chem 34: 2928-31 (1991)
BindingDB Entry DOI: 10.7270/Q2KH0NZG