BDBM50230180 CHEMBL4060841
SMILES: Nc1ncc2ccc(cc2n1)-c1ccc(NC(=S)Nc2ccc(OC(F)(F)F)cc2Br)cc1
InChI Key: InChIKey=UMGGFVAOWVEZEZ-UHFFFAOYSA-N
Data: 3 IC50
Activity Spreadsheet -- Enzyme Inhibition Constant Data from BindingDB
Found 3 hits for monomerid = 50230180
Trg + Lig
Ki
nM
ΔG°
kcal/mole
IC50
nM
Kd
nM
EC50/IC50
nM
koff
s-1
kon
M-1s-1
pHTemp
°C
Angiopoietin-1 receptor
(Homo sapiens (Human))
BDBM50230180
(CHEMBL4060841)
Show SMILES Nc1ncc2ccc(cc2n1)-c1ccc(NC(=S)Nc2ccc(OC(F)(F)F)cc2Br)cc1
Show InChI InChI=1S/C22H15BrF3N5OS/c23-17-10-16(32-22(24,25)26)7-8-18(17)31-21(33)29-15-5-3-12(4-6-15)13-1-2-14-11-28-20(27)30-19(14)9-13/h1-11H,(H2,27,28,30)(H2,29,31,33)
n/an/a 9.70n/an/an/an/an/an/a
Xi'an Jiaotong University
Curated by ChEMBL
Assay Description
Inhibition of TIE-2 (unknown origin) after 60 mins by ADP-Glo assay
Eur J Med Chem 127: 275-285 (2017)
BindingDB Entry DOI: 10.7270/Q2XW4N27
Ephrin type-B receptor 4
(Homo sapiens (Human))
BDBM50230180
(CHEMBL4060841)
Show SMILES Nc1ncc2ccc(cc2n1)-c1ccc(NC(=S)Nc2ccc(OC(F)(F)F)cc2Br)cc1
Show InChI InChI=1S/C22H15BrF3N5OS/c23-17-10-16(32-22(24,25)26)7-8-18(17)31-21(33)29-15-5-3-12(4-6-15)13-1-2-14-11-28-20(27)30-19(14)9-13/h1-11H,(H2,27,28,30)(H2,29,31,33)
Reactome pathway
n/an/a 49n/an/an/an/an/an/a
Xi'an Jiaotong University
Curated by ChEMBL
Assay Description
Inhibition of EphB4 (unknown origin) after 60 mins by ADP-Glo assay
Eur J Med Chem 127: 275-285 (2017)
BindingDB Entry DOI: 10.7270/Q2XW4N27
Vascular endothelial growth factor receptor 2
(Homo sapiens (Human))
BDBM50230180
(CHEMBL4060841)
Show SMILES Nc1ncc2ccc(cc2n1)-c1ccc(NC(=S)Nc2ccc(OC(F)(F)F)cc2Br)cc1
Show InChI InChI=1S/C22H15BrF3N5OS/c23-17-10-16(32-22(24,25)26)7-8-18(17)31-21(33)29-15-5-3-12(4-6-15)13-1-2-14-11-28-20(27)30-19(14)9-13/h1-11H,(H2,27,28,30)(H2,29,31,33)
NCI pathway
Reactome pathway
n/an/a 0.310n/an/an/an/an/an/a
Xi'an Jiaotong University
Curated by ChEMBL
Assay Description
Inhibition of VEGFR2 (unknown origin) after 60 mins by ADP-Glo assay
Eur J Med Chem 127: 275-285 (2017)
BindingDB Entry DOI: 10.7270/Q2XW4N27