BDBM50230368 CHEMBL4089687
SMILES: N\C(=N\C(=N/S(=O)(=O)c1ccc(Cl)cc1)\N1CC(C(=N1)c1ccc(Cl)cc1)c1ccccc1)c1ccccc1
InChI Key: InChIKey=QGGBJCCFQMWVFN-UHFFFAOYSA-N
Data: 2 KI  1 IC50
Activity Spreadsheet -- Enzyme Inhibition Constant Data from BindingDB
Found 3 hits for monomerid = 50230368
Trg + Lig
Ki
nM
ΔG°
kcal/mole
IC50
nM
Kd
nM
EC50/IC50
nM
koff
s-1
kon
M-1s-1
pHTemp
°C
Cannabinoid receptor 1
(Mus musculus (Mouse))
BDBM50230368
(CHEMBL4089687)
Show SMILES N\C(=N\C(=N/S(=O)(=O)c1ccc(Cl)cc1)\N1CC(C(=N1)c1ccc(Cl)cc1)c1ccccc1)c1ccccc1 |c:19|
Show InChI InChI=1S/C29H23Cl2N5O2S/c30-23-13-11-21(12-14-23)27-26(20-7-3-1-4-8-20)19-36(34-27)29(33-28(32)22-9-5-2-6-10-22)35-39(37,38)25-17-15-24(31)16-18-25/h1-18,26H,19H2,(H2,32,33,35)
26n/an/an/an/an/an/an/an/a
National Institute on Alcohol Abuse and Alcoholism
Curated by ChEMBL
Assay Description
Displacement of [3H]CP55940 from mouse brain CB1R expressed in CHOK1 cell membranes
J Med Chem 60: 1126-1141 (2017)
BindingDB Entry DOI: 10.7270/Q2WW7KXF
Cannabinoid receptor 2
(MOUSE)
BDBM50230368
(CHEMBL4089687)
Show SMILES N\C(=N\C(=N/S(=O)(=O)c1ccc(Cl)cc1)\N1CC(C(=N1)c1ccc(Cl)cc1)c1ccccc1)c1ccccc1 |c:19|
Show InChI InChI=1S/C29H23Cl2N5O2S/c30-23-13-11-21(12-14-23)27-26(20-7-3-1-4-8-20)19-36(34-27)29(33-28(32)22-9-5-2-6-10-22)35-39(37,38)25-17-15-24(31)16-18-25/h1-18,26H,19H2,(H2,32,33,35)
Reactome pathway
1.00E+3n/an/an/an/an/an/an/an/a
National Institute on Alcohol Abuse and Alcoholism
Curated by ChEMBL
Assay Description
Displacement of [3H]CP55940 from mouse CB2R expressed in CHOK1 cell membranes
J Med Chem 60: 1126-1141 (2017)
BindingDB Entry DOI: 10.7270/Q2WW7KXF
Cannabinoid receptor 1
(Mus musculus (Mouse))
BDBM50230368
(CHEMBL4089687)
Show SMILES N\C(=N\C(=N/S(=O)(=O)c1ccc(Cl)cc1)\N1CC(C(=N1)c1ccc(Cl)cc1)c1ccccc1)c1ccccc1 |c:19|
Show InChI InChI=1S/C29H23Cl2N5O2S/c30-23-13-11-21(12-14-23)27-26(20-7-3-1-4-8-20)19-36(34-27)29(33-28(32)22-9-5-2-6-10-22)35-39(37,38)25-17-15-24(31)16-18-25/h1-18,26H,19H2,(H2,32,33,35)
n/an/a 117n/an/an/an/an/an/a
National Institute on Alcohol Abuse and Alcoholism
Curated by ChEMBL
Assay Description
Inverse agonist at mouse brain CB1R expressed in CHOK1 cell membranes assessed as inhibition of CP55940-stimulated [35S]GTP-gammaS binding measured a...
J Med Chem 60: 1126-1141 (2017)
BindingDB Entry DOI: 10.7270/Q2WW7KXF