BDBM50230394 CHEMBL538801
SMILES: Cl.CC(c1c[nH]cn1)c1ccc2ccccc2c1
InChI Key: InChIKey=OEPDNECGECJPNR-UHFFFAOYSA-N
Data: 1 IC50
Activity Spreadsheet -- Enzyme Inhibition Constant Data from BindingDB
Found 1 hit for monomerid = 50230394
Trg + Lig
Ki
nM
ΔG°
kcal/mole
IC50
nM
Kd
nM
EC50/IC50
nM
koff
s-1
kon
M-1s-1
pHTemp
°C
Adrenergic receptor alpha-2
(Homo sapiens (Human))
BDBM50230394
(CHEMBL538801)
Show SMILES Cl.CC(c1c[nH]cn1)c1ccc2ccccc2c1
Show InChI InChI=1S/C15H14N2.ClH/c1-11(15-9-16-10-17-15)13-7-6-12-4-2-3-5-14(12)8-13;/h2-11H,1H3,(H,16,17);1H
n/an/a 0.120n/an/an/an/an/an/a
Ohio State University
Curated by ChEMBL
Assay Description
Compound was evaluated for Adrenergic activity against Alpha-2 adrenergic receptor in human platelets
J Med Chem 35: 750-5 (1992)
BindingDB Entry DOI: 10.7270/Q27H1MTJ