BDBM50231294 CHEMBL95266
SMILES: ClCC(=O)NC1CCc2ccccc2C1
InChI Key: InChIKey=BZGOUBAJQDKNIK-UHFFFAOYSA-N
Data: 1 KI  1 IC50
Activity Spreadsheet -- Enzyme Inhibition Constant Data from BindingDB
Found 2 hits for monomerid = 50231294
Trg + Lig
Ki
nM
ΔG°
kcal/mole
IC50
nM
Kd
nM
EC50/IC50
nM
koff
s-1
kon
M-1s-1
pHTemp
°C
Melatonin receptor
(Gallus gallus-Chick)
BDBM50231294
(CHEMBL95266)
Show SMILES ClCC(=O)NC1CCc2ccccc2C1
Show InChI InChI=1S/C12H14ClNO/c13-8-12(15)14-11-6-5-9-3-1-2-4-10(9)7-11/h1-4,11H,5-8H2,(H,14,15)
95n/an/an/an/an/an/an/an/a
University of Groningen
Curated by ChEMBL
Assay Description
Binding affinity to compete for 2-[125I]iodomelatonin binding to chicken retinal membranes
J Med Chem 36: 2891-8 (1993)
Article DOI: 10.1021/jm00072a008
BindingDB Entry DOI: 10.7270/Q2HT2RJK
Melatonin receptor
(Homo sapiens (Human))
BDBM50231294
(CHEMBL95266)
Show SMILES ClCC(=O)NC1CCc2ccccc2C1
Show InChI InChI=1S/C12H14ClNO/c13-8-12(15)14-11-6-5-9-3-1-2-4-10(9)7-11/h1-4,11H,5-8H2,(H,14,15)
n/an/a 1.30n/an/an/an/an/an/a
University of Groningen
Curated by ChEMBL
Assay Description
Inhibition of 2-[125I]iodomelatonin stimulated calcium dependent dopamine release from the rabbit retina.
J Med Chem 36: 2891-8 (1993)
Article DOI: 10.1021/jm00072a008
BindingDB Entry DOI: 10.7270/Q2HT2RJK