BDBM50231305 CHEMBL52801
SMILES: COc1ccccc1CCNC(C)=O
InChI Key: InChIKey=KYWSQJQPFHBYJL-UHFFFAOYSA-N
Data: 5 KI  1 IC50
Activity Spreadsheet -- Enzyme Inhibition Constant Data from BindingDB
Found 6 hits for monomerid = 50231305
Trg + Lig
Ki
nM
ΔG°
kcal/mole
IC50
nM
Kd
nM
EC50/IC50
nM
koff
s-1
kon
M-1s-1
pHTemp
°C
Melatonin receptor type 1C
(Gallus gallus)
BDBM50231305
(CHEMBL52801)
Show SMILES COc1ccccc1CCNC(C)=O
Show InChI InChI=1S/C11H15NO2/c1-9(13)12-8-7-10-5-3-4-6-11(10)14-2/h3-6H,7-8H2,1-2H3,(H,12,13)
213n/an/an/an/an/an/an/an/a
CNRS-BIOCIS
Curated by ChEMBL
Assay Description
Competitive binding by the displacement of 2-[125I]- Iodomelatonin binding from melatonin receptors in chicken brain membranes
J Med Chem 38: 2050-60 (1995)
Article DOI: 10.1021/jm00012a004
BindingDB Entry DOI: 10.7270/Q2ZS307H
Melatonin receptor type 1C
(Gallus gallus)
BDBM50231305
(CHEMBL52801)
Show SMILES COc1ccccc1CCNC(C)=O
Show InChI InChI=1S/C11H15NO2/c1-9(13)12-8-7-10-5-3-4-6-11(10)14-2/h3-6H,7-8H2,1-2H3,(H,12,13)
214n/an/an/an/an/an/an/an/a
Universit£ de Paris-Sud
Curated by ChEMBL
Assay Description
Binding affinity against chicken brain melatonin receptors using 2-[125I]iodomelatonin as radioligand
J Med Chem 40: 739-48 (1997)
Article DOI: 10.1021/jm960680+
BindingDB Entry DOI: 10.7270/Q2WQ06H4
Melatonin receptor type 1C
(Gallus gallus)
BDBM50231305
(CHEMBL52801)
Show SMILES COc1ccccc1CCNC(C)=O
Show InChI InChI=1S/C11H15NO2/c1-9(13)12-8-7-10-5-3-4-6-11(10)14-2/h3-6H,7-8H2,1-2H3,(H,12,13)
420n/an/an/an/an/an/an/an/a
University College London
Curated by ChEMBL
Assay Description
Binding affinity towards melatonin receptor in Chicken retinal membranes
J Med Chem 39: 1797-805 (1996)
Article DOI: 10.1021/jm9508189
BindingDB Entry DOI: 10.7270/Q29026HC
Melatonin receptor
(Gallus gallus-Chick)
BDBM50231305
(CHEMBL52801)
Show SMILES COc1ccccc1CCNC(C)=O
Show InChI InChI=1S/C11H15NO2/c1-9(13)12-8-7-10-5-3-4-6-11(10)14-2/h3-6H,7-8H2,1-2H3,(H,12,13)
420n/an/an/an/an/an/an/an/a
University of Groningen
Curated by ChEMBL
Assay Description
Binding affinity to compete for 2-[125I]iodomelatonin binding to chicken retinal membranes
J Med Chem 36: 2891-8 (1993)
Article DOI: 10.1021/jm00072a008
BindingDB Entry DOI: 10.7270/Q2HT2RJK
Melatonin receptor type 1C
(Gallus gallus)
BDBM50231305
(CHEMBL52801)
Show SMILES COc1ccccc1CCNC(C)=O
Show InChI InChI=1S/C11H15NO2/c1-9(13)12-8-7-10-5-3-4-6-11(10)14-2/h3-6H,7-8H2,1-2H3,(H,12,13)
573n/an/an/an/an/an/an/an/a
University College London
Curated by ChEMBL
Assay Description
Binding affinity towards melatonin receptor in chicken brain.
J Med Chem 39: 1797-805 (1996)
Article DOI: 10.1021/jm9508189
BindingDB Entry DOI: 10.7270/Q29026HC
Melatonin receptor
(Homo sapiens (Human))
BDBM50231305
(CHEMBL52801)
Show SMILES COc1ccccc1CCNC(C)=O
Show InChI InChI=1S/C11H15NO2/c1-9(13)12-8-7-10-5-3-4-6-11(10)14-2/h3-6H,7-8H2,1-2H3,(H,12,13)
n/an/a 3n/an/an/an/an/an/a
University of Groningen
Curated by ChEMBL
Assay Description
Inhibition of 2-[125I]iodomelatonin stimulated calcium dependent dopamine release from the rabbit retina.
J Med Chem 36: 2891-8 (1993)
Article DOI: 10.1021/jm00072a008
BindingDB Entry DOI: 10.7270/Q2HT2RJK