BDBM50231997 CHEMBL4089216
SMILES: CCCCCCCCCCCCCc1c(O)c(OC)cc(O)c1OC
InChI Key: InChIKey=STGDPYFIKOIHRA-UHFFFAOYSA-N
Data: 2 IC50
Activity Spreadsheet -- Enzyme Inhibition Constant Data from BindingDB
Found 2 hits for monomerid = 50231997
Trg + Lig
Ki
nM
ΔG°
kcal/mole
IC50
nM
Kd
nM
EC50/IC50
nM
koff
s-1
kon
M-1s-1
pHTemp
°C
Arachidonate 5-lipoxygenase
(Homo sapiens (Human))
BDBM50231997
(CHEMBL4089216)
Show SMILES CCCCCCCCCCCCCc1c(O)c(OC)cc(O)c1OC
Show InChI InChI=1S/C21H36O4/c1-4-5-6-7-8-9-10-11-12-13-14-15-17-20(23)19(24-2)16-18(22)21(17)25-3/h16,22-23H,4-15H2,1-3H3
Reactome pathway
n/an/a 310n/an/an/an/an/an/a
Second University of Naples
Curated by ChEMBL
Assay Description
Inhibition of 5-lipoxygenase in human neutrophils assessed as inhibition of A23187-induced product formation using arachidonic acid as substrate prei...
Eur J Med Chem 127: 715-726 (2017)
BindingDB Entry DOI: 10.7270/Q2DR2XQ8
Arachidonate 5-lipoxygenase
(Homo sapiens (Human))
BDBM50231997
(CHEMBL4089216)
Show SMILES CCCCCCCCCCCCCc1c(O)c(OC)cc(O)c1OC
Show InChI InChI=1S/C21H36O4/c1-4-5-6-7-8-9-10-11-12-13-14-15-17-20(23)19(24-2)16-18(22)21(17)25-3/h16,22-23H,4-15H2,1-3H3
Reactome pathway
n/an/a 260n/an/an/an/an/an/a
Second University of Naples
Curated by ChEMBL
Assay Description
Inhibition of recombinant human 5-lipoxygenase expressed in Escherichia coli BL21 using arachidonic acid as substrate preincubated for 15 mins follow...
Eur J Med Chem 127: 715-726 (2017)
BindingDB Entry DOI: 10.7270/Q2DR2XQ8