null
SMILES: CCCCCCCCCCCCCc1c(O)c(O)cc(OC)c1OC
InChI Key: InChIKey=RZQMRTGRFDGBDE-UHFFFAOYSA-N
Activity Spreadsheet -- Enzyme Inhibition Constant Data from BindingDB
Found 2 hits for monomerid = 50231998
Trg + Lig
Ki
nM
ΔG°
kcal/mole
IC50
nM
Kd
nM
EC50/IC50
nM
koff
s-1
kon
M-1s-1
pHTemp
°C
Polyunsaturated fatty acid 5-lipoxygenase
(Homo sapiens (Human))
BDBM50231998
(CHEMBL4085835)
Show SMILES CCCCCCCCCCCCCc1c(O)c(O)cc(OC)c1OC
Show InChI InChI=1S/C21H36O4/c1-4-5-6-7-8-9-10-11-12-13-14-15-17-20(23)18(22)16-19(24-2)21(17)25-3/h16,22-23H,4-15H2,1-3H3
Reactome pathway
n/an/a 28n/an/an/an/an/an/a
Second University of Naples
Curated by ChEMBL
Assay Description
Inhibition of 5-lipoxygenase in human neutrophils assessed as inhibition of A23187-induced product formation using arachidonic acid as substrate prei...
Eur J Med Chem 127: 715-726 (2017)
BindingDB Entry DOI: 10.7270/Q2DR2XQ8
Polyunsaturated fatty acid 5-lipoxygenase
(Homo sapiens (Human))
BDBM50231998
(CHEMBL4085835)
Show SMILES CCCCCCCCCCCCCc1c(O)c(O)cc(OC)c1OC
Show InChI InChI=1S/C21H36O4/c1-4-5-6-7-8-9-10-11-12-13-14-15-17-20(23)18(22)16-19(24-2)21(17)25-3/h16,22-23H,4-15H2,1-3H3
Reactome pathway
n/an/a 60n/an/an/an/an/an/a
Second University of Naples
Curated by ChEMBL
Assay Description
Inhibition of recombinant human 5-lipoxygenase expressed in Escherichia coli BL21 using arachidonic acid as substrate preincubated for 15 mins follow...
Eur J Med Chem 127: 715-726 (2017)
BindingDB Entry DOI: 10.7270/Q2DR2XQ8