null
SMILES: COC1=CC(=O)C(=O)C(CCCCCCCCCCCO)=C1OC
InChI Key: InChIKey=MBKSIONPOPLZQQ-UHFFFAOYSA-N
Activity Spreadsheet -- Enzyme Inhibition Constant Data from BindingDB
Found 2 hits for monomerid = 50232002
Trg + Lig
Ki
nM
ΔG°
kcal/mole
IC50
nM
Kd
nM
EC50/IC50
nM
koff
s-1
kon
M-1s-1
pHTemp
°C
Polyunsaturated fatty acid 5-lipoxygenase
(Homo sapiens (Human))
BDBM50232002
(CHEMBL4095644)
Show SMILES COC1=CC(=O)C(=O)C(CCCCCCCCCCCO)=C1OC |c:20,t:2|
Show InChI InChI=1S/C19H30O5/c1-23-17-14-16(21)18(22)15(19(17)24-2)12-10-8-6-4-3-5-7-9-11-13-20/h14,20H,3-13H2,1-2H3
Reactome pathway
n/an/a 120n/an/an/an/an/an/a
Second University of Naples
Curated by ChEMBL
Assay Description
Inhibition of 5-lipoxygenase in human neutrophils assessed as inhibition of A23187-induced product formation using arachidonic acid as substrate prei...
Eur J Med Chem 127: 715-726 (2017)
BindingDB Entry DOI: 10.7270/Q2DR2XQ8
Polyunsaturated fatty acid 5-lipoxygenase
(Homo sapiens (Human))
BDBM50232002
(CHEMBL4095644)
Show SMILES COC1=CC(=O)C(=O)C(CCCCCCCCCCCO)=C1OC |c:20,t:2|
Show InChI InChI=1S/C19H30O5/c1-23-17-14-16(21)18(22)15(19(17)24-2)12-10-8-6-4-3-5-7-9-11-13-20/h14,20H,3-13H2,1-2H3
Reactome pathway
n/an/a 1.96E+3n/an/an/an/an/an/a
Second University of Naples
Curated by ChEMBL
Assay Description
Inhibition of recombinant human 5-lipoxygenase expressed in Escherichia coli BL21 using arachidonic acid as substrate preincubated for 15 mins follow...
Eur J Med Chem 127: 715-726 (2017)
BindingDB Entry DOI: 10.7270/Q2DR2XQ8