BDBM50232176 CHEMBL4091749
SMILES: Oc1ccc(F)c(C(=O)c2ccc(s2)-c2cc(Cl)c(O)c(Cl)c2)c1F
InChI Key: InChIKey=NQBPRKUJPGFZQA-UHFFFAOYSA-N
Data: 2 IC50
Activity Spreadsheet -- Enzyme Inhibition Constant Data from BindingDB
Found 2 hits for monomerid = 50232176
Trg + Lig
Ki
nM
ΔG°
kcal/mole
IC50
nM
Kd
nM
EC50/IC50
nM
koff
s-1
kon
M-1s-1
pHTemp
°C
Estradiol 17-beta-dehydrogenase 1
(Homo sapiens (Human))
BDBM50232176
(CHEMBL4091749)
Show SMILES Oc1ccc(F)c(C(=O)c2ccc(s2)-c2cc(Cl)c(O)c(Cl)c2)c1F
Show InChI InChI=1S/C17H8Cl2F2O3S/c18-8-5-7(6-9(19)16(8)23)12-3-4-13(25-12)17(24)14-10(20)1-2-11(22)15(14)21/h1-6,22-23H
Reactome pathway
n/an/a 2.40n/an/an/an/an/an/a
Saarland University
Curated by ChEMBL
Assay Description
Inhibition of human placental cytosolic 17beta-HSD1 assessed as reduction in activation of [2,4,6,7-3H]-E1 substrate to E2 after 10 mins in presence ...
Eur J Med Chem 127: 944-957 (2017)
BindingDB Entry DOI: 10.7270/Q2WS8WH4
Estradiol 17-beta-dehydrogenase 2
(Homo sapiens (Human))
BDBM50232176
(CHEMBL4091749)
Show SMILES Oc1ccc(F)c(C(=O)c2ccc(s2)-c2cc(Cl)c(O)c(Cl)c2)c1F
Show InChI InChI=1S/C17H8Cl2F2O3S/c18-8-5-7(6-9(19)16(8)23)12-3-4-13(25-12)17(24)14-10(20)1-2-11(22)15(14)21/h1-6,22-23H
n/an/a 39n/an/an/an/an/an/a
Saarland University
Curated by ChEMBL
Assay Description
Inhibition of human placental microsomal 17beta-HSD2 using [2,4,6,7-3H]-E2 as substrate after 20 mins in presence of NAD+ by RP-HPLC method
Eur J Med Chem 127: 944-957 (2017)
BindingDB Entry DOI: 10.7270/Q2WS8WH4