BDBM50232233 4-(2-chlorophenyl)-9-hydroxy-8-(3-morpholinopropoxy)pyrrolo[3,4-c]carbazole-1,3(2H,6H)-dione::CHEMBL256480
SMILES: Oc1cc2c(cc1OCCCN1CCOCC1)[nH]c1cc(c3C(=O)NC(=O)c3c21)-c1ccccc1Cl
InChI Key: InChIKey=PRKCCLJEHATTSX-UHFFFAOYSA-N
Data: 3 IC50
Activity Spreadsheet -- Enzyme Inhibition Constant Data from BindingDB
Found 3 hits for monomerid = 50232233
Trg + Lig
Ki
nM
ΔG°
kcal/mole
IC50
nM
Kd
nM
EC50/IC50
nM
koff
s-1
kon
M-1s-1
pHTemp
°C
Serine/threonine-protein kinase Chk1
(Homo sapiens (Human))
BDBM50232233
(4-(2-chlorophenyl)-9-hydroxy-8-(3-morpholinopropox...)
Show SMILES Oc1cc2c(cc1OCCCN1CCOCC1)[nH]c1cc(c3C(=O)NC(=O)c3c21)-c1ccccc1Cl
Show InChI InChI=1S/C27H24ClN3O5/c28-18-5-2-1-4-15(18)16-12-20-23(25-24(16)26(33)30-27(25)34)17-13-21(32)22(14-19(17)29-20)36-9-3-6-31-7-10-35-11-8-31/h1-2,4-5,12-14,29,32H,3,6-11H2,(H,30,33,34)
Reactome pathway
n/an/a 41n/an/an/an/an/an/a
University of Auckland
Curated by ChEMBL
Assay Description
Inhibition of Chk1
Bioorg Med Chem Lett 18: 929-33 (2008)
Article DOI: 10.1016/j.bmcl.2007.12.046
BindingDB Entry DOI: 10.7270/Q2ZS2XC3
Serine/threonine-protein kinase WEE1
(Homo sapiens (Human))
BDBM50232233
(4-(2-chlorophenyl)-9-hydroxy-8-(3-morpholinopropox...)
Show SMILES Oc1cc2c(cc1OCCCN1CCOCC1)[nH]c1cc(c3C(=O)NC(=O)c3c21)-c1ccccc1Cl
Show InChI InChI=1S/C27H24ClN3O5/c28-18-5-2-1-4-15(18)16-12-20-23(25-24(16)26(33)30-27(25)34)17-13-21(32)22(14-19(17)29-20)36-9-3-6-31-7-10-35-11-8-31/h1-2,4-5,12-14,29,32H,3,6-11H2,(H,30,33,34)
NCI pathway
Reactome pathway
n/an/a 26n/an/an/an/an/an/a
University of Auckland
Curated by ChEMBL
Assay Description
Inhibition of human Wee1
Bioorg Med Chem Lett 18: 929-33 (2008)
Article DOI: 10.1016/j.bmcl.2007.12.046
BindingDB Entry DOI: 10.7270/Q2ZS2XC3
Serine/threonine-protein kinase WEE1
(Homo sapiens (Human))
BDBM50232233
(4-(2-chlorophenyl)-9-hydroxy-8-(3-morpholinopropox...)
Show SMILES Oc1cc2c(cc1OCCCN1CCOCC1)[nH]c1cc(c3C(=O)NC(=O)c3c21)-c1ccccc1Cl
Show InChI InChI=1S/C27H24ClN3O5/c28-18-5-2-1-4-15(18)16-12-20-23(25-24(16)26(33)30-27(25)34)17-13-21(32)22(14-19(17)29-20)36-9-3-6-31-7-10-35-11-8-31/h1-2,4-5,12-14,29,32H,3,6-11H2,(H,30,33,34)
NCI pathway
Reactome pathway
n/an/a 26n/an/an/an/an/an/a
Chulalongkorn University
Curated by ChEMBL
Assay Description
Inhibition of human Wee1
Eur J Med Chem 44: 1383-95 (2009)
Article DOI: 10.1016/j.ejmech.2008.09.027
BindingDB Entry DOI: 10.7270/Q2X34XB6