BDBM50232240 4-(2-chlorophenyl)-8-(4-(dimethylamino)butyl)-9-hydroxypyrrolo[3,4-c]carbazole-1,3(2H,6H)-dione::CHEMBL401746
SMILES: CN(C)CCCCc1cc2[nH]c3cc(c4C(=O)NC(=O)c4c3c2cc1O)-c1ccccc1Cl
InChI Key: InChIKey=CWXCDIQIRXEVOH-UHFFFAOYSA-N
Data: 4 IC50
Activity Spreadsheet -- Enzyme Inhibition Constant Data from BindingDB
Found 4 hits for monomerid = 50232240
Trg + Lig
Ki
nM
ΔG°
kcal/mole
IC50
nM
Kd
nM
EC50/IC50
nM
koff
s-1
kon
M-1s-1
pHTemp
°C
Serine/threonine-protein kinase Chk1
(Homo sapiens (Human))
BDBM50232240
(4-(2-chlorophenyl)-8-(4-(dimethylamino)butyl)-9-hy...)
Show SMILES CN(C)CCCCc1cc2[nH]c3cc(c4C(=O)NC(=O)c4c3c2cc1O)-c1ccccc1Cl
Show InChI InChI=1S/C26H24ClN3O3/c1-30(2)10-6-5-7-14-11-19-17(13-21(14)31)22-20(28-19)12-16(15-8-3-4-9-18(15)27)23-24(22)26(33)29-25(23)32/h3-4,8-9,11-13,28,31H,5-7,10H2,1-2H3,(H,29,32,33)
Reactome pathway
n/an/a 55n/an/an/an/an/an/a
University of Auckland
Curated by ChEMBL
Assay Description
Inhibition of Chk1
Bioorg Med Chem Lett 18: 929-33 (2008)
Article DOI: 10.1016/j.bmcl.2007.12.046
BindingDB Entry DOI: 10.7270/Q2ZS2XC3
Serine/threonine-protein kinase WEE1
(Homo sapiens (Human))
BDBM50232240
(4-(2-chlorophenyl)-8-(4-(dimethylamino)butyl)-9-hy...)
Show SMILES CN(C)CCCCc1cc2[nH]c3cc(c4C(=O)NC(=O)c4c3c2cc1O)-c1ccccc1Cl
Show InChI InChI=1S/C26H24ClN3O3/c1-30(2)10-6-5-7-14-11-19-17(13-21(14)31)22-20(28-19)12-16(15-8-3-4-9-18(15)27)23-24(22)26(33)29-25(23)32/h3-4,8-9,11-13,28,31H,5-7,10H2,1-2H3,(H,29,32,33)
NCI pathway
Reactome pathway
n/an/a 49n/an/an/an/an/an/a
University of Auckland
Curated by ChEMBL
Assay Description
Inhibition of human Wee1
Bioorg Med Chem Lett 18: 929-33 (2008)
Article DOI: 10.1016/j.bmcl.2007.12.046
BindingDB Entry DOI: 10.7270/Q2ZS2XC3
Serine/threonine-protein kinase WEE1
(Homo sapiens (Human))
BDBM50232240
(4-(2-chlorophenyl)-8-(4-(dimethylamino)butyl)-9-hy...)
Show SMILES CN(C)CCCCc1cc2[nH]c3cc(c4C(=O)NC(=O)c4c3c2cc1O)-c1ccccc1Cl
Show InChI InChI=1S/C26H24ClN3O3/c1-30(2)10-6-5-7-14-11-19-17(13-21(14)31)22-20(28-19)12-16(15-8-3-4-9-18(15)27)23-24(22)26(33)29-25(23)32/h3-4,8-9,11-13,28,31H,5-7,10H2,1-2H3,(H,29,32,33)
NCI pathway
Reactome pathway
n/an/a 49n/an/an/an/an/an/a
Chulalongkorn University
Curated by ChEMBL
Assay Description
Inhibition of human Wee1
Eur J Med Chem 44: 1383-95 (2009)
Article DOI: 10.1016/j.ejmech.2008.09.027
BindingDB Entry DOI: 10.7270/Q2X34XB6
Cyclin-dependent kinase 1
(Homo sapiens (Human))
BDBM50232240
(4-(2-chlorophenyl)-8-(4-(dimethylamino)butyl)-9-hy...)
Show SMILES CN(C)CCCCc1cc2[nH]c3cc(c4C(=O)NC(=O)c4c3c2cc1O)-c1ccccc1Cl
Show InChI InChI=1S/C26H24ClN3O3/c1-30(2)10-6-5-7-14-11-19-17(13-21(14)31)22-20(28-19)12-16(15-8-3-4-9-18(15)27)23-24(22)26(33)29-25(23)32/h3-4,8-9,11-13,28,31H,5-7,10H2,1-2H3,(H,29,32,33)
Reactome pathway
n/an/a 250n/an/an/an/an/an/a
University of Auckland
Curated by ChEMBL
Assay Description
Inhibition of human Cdc2 kinase PY15 phosphorylation in HT29 cells by Western blot
Bioorg Med Chem Lett 18: 929-33 (2008)
Article DOI: 10.1016/j.bmcl.2007.12.046
BindingDB Entry DOI: 10.7270/Q2ZS2XC3