BDBM50232473 CHEMBL4087627
SMILES: NC(=S)N\N=C(/c1cccc(O)c1)c1cc(Br)cc(Br)c1
InChI Key: InChIKey=RISJFQWXMQSRIY-QGOAFFKASA-N
Data: 1 KI  2 IC50
Activity Spreadsheet -- Enzyme Inhibition Constant Data from BindingDB
Found 3 hits for monomerid = 50232473
Trg + Lig
Ki
nM
ΔG°
kcal/mole
IC50
nM
Kd
nM
EC50/IC50
nM
koff
s-1
kon
M-1s-1
pHTemp
°C
Procathepsin L
(Homo sapiens (Human))
BDBM50232473
(CHEMBL4087627)
Show SMILES NC(=S)N\N=C(/c1cccc(O)c1)c1cc(Br)cc(Br)c1
Show InChI InChI=1S/C14H11Br2N3OS/c15-10-4-9(5-11(16)7-10)13(18-19-14(17)21)8-2-1-3-12(20)6-8/h1-7,20H,(H3,17,19,21)/b18-13+
Reactome pathway
8.40n/an/an/an/an/an/an/an/a
Baylor University
Curated by ChEMBL
Assay Description
Covalent/reversible inhibition of human liver cathepsin-L using Z-FR-AMC as substrate preincubated for 5 mins followed by substrate addition measured...
Bioorg Med Chem Lett 27: 1304-1310 (2017)
BindingDB Entry DOI: 10.7270/Q23B62C1
Cathepsin B
(Homo sapiens (Human))
BDBM50232473
(CHEMBL4087627)
Show SMILES NC(=S)N\N=C(/c1cccc(O)c1)c1cc(Br)cc(Br)c1
Show InChI InChI=1S/C14H11Br2N3OS/c15-10-4-9(5-11(16)7-10)13(18-19-14(17)21)8-2-1-3-12(20)6-8/h1-7,20H,(H3,17,19,21)/b18-13+
Reactome pathway
n/an/a>1.00E+4n/an/an/an/an/an/a
Baylor University
Curated by ChEMBL
Assay Description
Inhibition of human liver cathepsin-B using Z-RR-AMC as substrate preincubated for 5 mins followed by substrate addition measured for 5 mins by fluor...
Bioorg Med Chem Lett 27: 1304-1310 (2017)
BindingDB Entry DOI: 10.7270/Q23B62C1
Procathepsin L
(Homo sapiens (Human))
BDBM50232473
(CHEMBL4087627)
Show SMILES NC(=S)N\N=C(/c1cccc(O)c1)c1cc(Br)cc(Br)c1
Show InChI InChI=1S/C14H11Br2N3OS/c15-10-4-9(5-11(16)7-10)13(18-19-14(17)21)8-2-1-3-12(20)6-8/h1-7,20H,(H3,17,19,21)/b18-13+
Reactome pathway
n/an/a 202n/an/an/an/an/an/a
Baylor University
Curated by ChEMBL
Assay Description
Inhibition of human liver cathepsin-L using Z-FR-AMC as substrate preincubated for 5 mins followed by substrate addition measured at 15 sec interval ...
Bioorg Med Chem Lett 27: 1304-1310 (2017)
BindingDB Entry DOI: 10.7270/Q23B62C1