null
SMILES: Nc1nc(N)c2c(COc3ccc(F)cc3F)cccc2n1
InChI Key: InChIKey=UDMADSHXMKHDNN-UHFFFAOYSA-N
Activity Spreadsheet -- Enzyme Inhibition Constant Data from BindingDB
Found 3 hits for monomerid = 50232526
Trg + Lig
Ki
nM
ΔG°
kcal/mole
IC50
nM
Kd
nM
EC50/IC50
nM
koff
s-1
kon
M-1s-1
pHTemp
°C
Dihydrofolate reductase
(Homo sapiens (Human))
BDBM50232526
(5-((2,4-difluorophenoxy)methyl)quinazoline-2,4-dia...)
Show SMILES Nc1nc(N)c2c(COc3ccc(F)cc3F)cccc2n1
Show InChI InChI=1S/C15H12F2N4O/c16-9-4-5-12(10(17)6-9)22-7-8-2-1-3-11-13(8)14(18)21-15(19)20-11/h1-6H,7H2,(H4,18,19,20,21)
NCI pathway
Reactome pathway
n/an/a 1.07E+4n/an/an/an/an/an/a
deCODE Chemistry Inc
Curated by ChEMBL
Assay Description
Inhibition of human recombinant DHFR
J Med Chem 51: 449-69 (2008)
Article DOI: 10.1021/jm061475p
BindingDB Entry DOI: 10.7270/Q27S7NJD
m7GpppX diphosphatase
(Homo sapiens (Human))
BDBM50232526
(5-((2,4-difluorophenoxy)methyl)quinazoline-2,4-dia...)
Show SMILES Nc1nc(N)c2c(COc3ccc(F)cc3F)cccc2n1
Show InChI InChI=1S/C15H12F2N4O/c16-9-4-5-12(10(17)6-9)22-7-8-2-1-3-11-13(8)14(18)21-15(19)20-11/h1-6H,7H2,(H4,18,19,20,21)
Reactome pathway
n/an/a 0.0200n/an/an/an/an/an/a
Pfizer Inc.
Curated by ChEMBL
Assay Description
Inhibition of human DcpS assessed as increase in SMN2 promoter activity
J Med Chem 60: 3094-3108 (2017)
Article DOI: 10.1021/acs.jmedchem.7b00124
BindingDB Entry DOI: 10.7270/Q2251MG2
Dihydrofolate reductase
(Homo sapiens (Human))
BDBM50232526
(5-((2,4-difluorophenoxy)methyl)quinazoline-2,4-dia...)
Show SMILES Nc1nc(N)c2c(COc3ccc(F)cc3F)cccc2n1
Show InChI InChI=1S/C15H12F2N4O/c16-9-4-5-12(10(17)6-9)22-7-8-2-1-3-11-13(8)14(18)21-15(19)20-11/h1-6H,7H2,(H4,18,19,20,21)
NCI pathway
Reactome pathway
n/an/a>5.00E+4n/an/an/an/an/an/a
Pfizer Inc.
Curated by ChEMBL
Assay Description
In vitro reversal of vecuronium-induced block in isolated guinea pig hemi-diaphragm.
J Med Chem 60: 3094-3108 (2017)
Article DOI: 10.1021/acs.jmedchem.7b00124
BindingDB Entry DOI: 10.7270/Q2251MG2