BDBM50232590 CHEMBL4101459
SMILES: CC[C@H]1N(C2CCCC2)c2nc(Nc3ccc(cc3OC)C(=O)NC3CCN(C)CC3)ncc2-n2cnc(CO)c12
InChI Key: InChIKey=TYJHZOFBUGXDFG-XMMPIXPASA-N
Data: 1 IC50
Activity Spreadsheet -- Enzyme Inhibition Constant Data from BindingDB
Found 1 hit for monomerid = 50232590
Trg + Lig
Ki
nM
ΔG°
kcal/mole
IC50
nM
Kd
nM
EC50/IC50
nM
koff
s-1
kon
M-1s-1
pHTemp
°C
Serine/threonine-protein kinase PLK1
(Homo sapiens (Human))
BDBM50232590
(CHEMBL4101459)
Show SMILES CC[C@H]1N(C2CCCC2)c2nc(Nc3ccc(cc3OC)C(=O)NC3CCN(C)CC3)ncc2-n2cnc(CO)c12 |r|
Show InChI InChI=1S/C30H40N8O3/c1-4-24-27-23(17-39)32-18-37(27)25-16-31-30(35-28(25)38(24)21-7-5-6-8-21)34-22-10-9-19(15-26(22)41-3)29(40)33-20-11-13-36(2)14-12-20/h9-10,15-16,18,20-21,24,39H,4-8,11-14,17H2,1-3H3,(H,33,40)(H,31,34,35)/t24-/m1/s1
NCI pathway
Reactome pathway
n/an/a 2.20n/an/an/an/an/an/a
Takeda California
Curated by ChEMBL
Assay Description
Inhibition of human FLAG-tagged PLK1 expressed in baculovirus infected sf21 cells using Biotin-AGAGTVPESIHSFIGDGLV as substrate by TR-FRET assay
Bioorg Med Chem Lett 27: 1311-1315 (2017)
BindingDB Entry DOI: 10.7270/Q2K939RQ