null
SMILES: Nc1ccccc1NC(=O)c1ccc(CNc2nc3ccc(Br)cc3s2)cc1
InChI Key: InChIKey=UBEDKYNGAVJFEP-UHFFFAOYSA-N
Activity Spreadsheet -- Enzyme Inhibition Constant Data from BindingDB
Found 2 hits for monomerid = 50232646
Trg + Lig
Ki
nM
ΔG°
kcal/mole
IC50
nM
Kd
nM
EC50/IC50
nM
koff
s-1
kon
M-1s-1
pHTemp
°C
Histone deacetylase 1
(Homo sapiens (Human))
BDBM50232646
(CHEMBL254112 | N-(2-aminophenyl)-4-((6-bromobenzo[...)
Show SMILES Nc1ccccc1NC(=O)c1ccc(CNc2nc3ccc(Br)cc3s2)cc1
Show InChI InChI=1S/C21H17BrN4OS/c22-15-9-10-18-19(11-15)28-21(26-18)24-12-13-5-7-14(8-6-13)20(27)25-17-4-2-1-3-16(17)23/h1-11H,12,23H2,(H,24,26)(H,25,27)
NCI pathway
Reactome pathway
n/an/an/an/a 2.00E+3n/an/an/an/a
MethylGene Inc.
Curated by ChEMBL
Assay Description
Inhibition of HDAC1 in human T24 cells assessed as induction of histone H4 acetylation after 16 hrs relative to MS-275
Bioorg Med Chem Lett 18: 1502-6 (2008)
Article DOI: 10.1016/j.bmcl.2007.12.057
BindingDB Entry DOI: 10.7270/Q2416WT0
Histone deacetylase 1
(Homo sapiens (Human))
BDBM50232646
(CHEMBL254112 | N-(2-aminophenyl)-4-((6-bromobenzo[...)
Show SMILES Nc1ccccc1NC(=O)c1ccc(CNc2nc3ccc(Br)cc3s2)cc1
Show InChI InChI=1S/C21H17BrN4OS/c22-15-9-10-18-19(11-15)28-21(26-18)24-12-13-5-7-14(8-6-13)20(27)25-17-4-2-1-3-16(17)23/h1-11H,12,23H2,(H,24,26)(H,25,27)
NCI pathway
Reactome pathway
n/an/a 50n/an/an/an/an/an/a
MethylGene Inc.
Curated by ChEMBL
Assay Description
Inhibition of recombinant HDAC1
Bioorg Med Chem Lett 18: 1502-6 (2008)
Article DOI: 10.1016/j.bmcl.2007.12.057
BindingDB Entry DOI: 10.7270/Q2416WT0