BDBM50232658 CHEMBL254311::N-(2-aminophenyl)-4-((6-(2-morpholinoethylamino)benzo[d]thiazol-2-ylthio)methyl)benzamide
SMILES: Nc1ccccc1NC(=O)c1ccc(CSc2nc3ccc(NCCN4CCOCC4)cc3s2)cc1
InChI Key: InChIKey=TWGZILOJVHVTLA-UHFFFAOYSA-N
Data: 1 IC50  1 EC50
Activity Spreadsheet -- Enzyme Inhibition Constant Data from BindingDB
Found 2 hits for monomerid = 50232658
Trg + Lig
Ki
nM
ΔG°
kcal/mole
IC50
nM
Kd
nM
EC50/IC50
nM
koff
s-1
kon
M-1s-1
pHTemp
°C
Histone deacetylase 1
(Homo sapiens (Human))
BDBM50232658
(CHEMBL254311 | N-(2-aminophenyl)-4-((6-(2-morpholi...)
Show SMILES Nc1ccccc1NC(=O)c1ccc(CSc2nc3ccc(NCCN4CCOCC4)cc3s2)cc1
Show InChI InChI=1S/C27H29N5O2S2/c28-22-3-1-2-4-23(22)30-26(33)20-7-5-19(6-8-20)18-35-27-31-24-10-9-21(17-25(24)36-27)29-11-12-32-13-15-34-16-14-32/h1-10,17,29H,11-16,18,28H2,(H,30,33)
NCI pathway
Reactome pathway
n/an/an/an/a 5.00E+3n/an/an/an/a
MethylGene Inc.
Curated by ChEMBL
Assay Description
Inhibition of HDAC1 in human T24 cells assessed as induction of histone H4 acetylation after 16 hrs relative to MS-275
Bioorg Med Chem Lett 18: 1502-6 (2008)
Article DOI: 10.1016/j.bmcl.2007.12.057
BindingDB Entry DOI: 10.7270/Q2416WT0
Histone deacetylase 1
(Homo sapiens (Human))
BDBM50232658
(CHEMBL254311 | N-(2-aminophenyl)-4-((6-(2-morpholi...)
Show SMILES Nc1ccccc1NC(=O)c1ccc(CSc2nc3ccc(NCCN4CCOCC4)cc3s2)cc1
Show InChI InChI=1S/C27H29N5O2S2/c28-22-3-1-2-4-23(22)30-26(33)20-7-5-19(6-8-20)18-35-27-31-24-10-9-21(17-25(24)36-27)29-11-12-32-13-15-34-16-14-32/h1-10,17,29H,11-16,18,28H2,(H,30,33)
NCI pathway
Reactome pathway
n/an/a 70n/an/an/an/an/an/a
MethylGene Inc.
Curated by ChEMBL
Assay Description
Inhibition of recombinant HDAC1
Bioorg Med Chem Lett 18: 1502-6 (2008)
Article DOI: 10.1016/j.bmcl.2007.12.057
BindingDB Entry DOI: 10.7270/Q2416WT0