BDBM50232686 CHEMBL4088360
SMILES: NCCc1ccncc1
InChI Key: InChIKey=IDLHTECVNDEOIY-UHFFFAOYSA-N
Data: 1 IC50
Activity Spreadsheet -- Enzyme Inhibition Constant Data from BindingDB
Found 1 hit for monomerid = 50232686
Trg + Lig
Ki
nM
ΔG°
kcal/mole
IC50
nM
Kd
nM
EC50/IC50
nM
koff
s-1
kon
M-1s-1
pHTemp
°C
Lysyl oxidase homolog 2
(Homo sapiens (Human))
BDBM50232686
(CHEMBL4088360)
Show SMILES NCCc1ccncc1
Show InChI InChI=1S/C7H10N2/c8-4-1-7-2-5-9-6-3-7/h2-3,5-6H,1,4,8H2
n/an/a 8.21E+3n/an/an/an/an/an/a
PharmAkea Inc.
Curated by ChEMBL
Assay Description
Inhibition of full length recombinant human LOXL2 expressed in CHO cells assessed as reduction in H2O2 production using DAP as substrate preincubated...
ACS Med Chem Lett 8: 423-427 (2017)
BindingDB Entry DOI: 10.7270/Q2542QV6