BDBM50232693 CHEMBL4072524
SMILES: NCc1ccnc(c1)-c1cccnc1
InChI Key: InChIKey=VJGZHSIYZMBNBO-UHFFFAOYSA-N
Data: 1 IC50
Activity Spreadsheet -- Enzyme Inhibition Constant Data from BindingDB
Found 1 hit for monomerid = 50232693
Trg + Lig
Ki
nM
ΔG°
kcal/mole
IC50
nM
Kd
nM
EC50/IC50
nM
koff
s-1
kon
M-1s-1
pHTemp
°C
Lysyl oxidase homolog 2
(Homo sapiens (Human))
BDBM50232693
(CHEMBL4072524)
Show SMILES NCc1ccnc(c1)-c1cccnc1
Show InChI InChI=1S/C11H11N3/c12-7-9-3-5-14-11(6-9)10-2-1-4-13-8-10/h1-6,8H,7,12H2
n/an/a 321n/an/an/an/an/an/a
PharmAkea Inc.
Curated by ChEMBL
Assay Description
Inhibition of full length recombinant human LOXL2 expressed in CHO cells assessed as reduction in H2O2 production using DAP as substrate preincubated...
ACS Med Chem Lett 8: 423-427 (2017)
BindingDB Entry DOI: 10.7270/Q2542QV6