BDBM50232885 CHEMBL4089150
SMILES: [H][C@]12C[C@@]3([H])C4=CCO[C@@]5([H])\C(=N/O)C(=O)N6c7ccccc7[C@@]1(CCN2C4)[C@]6([H])[C@@]35[H]
InChI Key: InChIKey=CMOAVMXESDVBSR-SJOSXICLSA-N
Data: 1 KI  6 IC50
Activity Spreadsheet -- Enzyme Inhibition Constant Data from BindingDB
Found 7 hits for monomerid = 50232885
Trg + Lig
Ki
nM
ΔG°
kcal/mole
IC50
nM
Kd
nM
EC50/IC50
nM
koff
s-1
kon
M-1s-1
pHTemp
°C
Glycine receptor subunit alpha-1
(Homo sapiens (Human))
BDBM50232885
(CHEMBL4089150)
Show SMILES [H][C@]12C[C@@]3([H])C4=CCO[C@@]5([H])\C(=N/O)C(=O)N6c7ccccc7[C@@]1(CCN2C4)[C@]6([H])[C@@]35[H] |r,c:5|
Show InChI InChI=1S/C21H21N3O3/c25-20-17(22-26)18-16-12-9-15-21(6-7-23(15)10-11(12)5-8-27-18)13-3-1-2-4-14(13)24(20)19(16)21/h1-5,12,15-16,18-19,26H,6-10H2/b22-17+/t12-,15-,16-,18+,19-,21+/m0/s1
40n/an/an/an/an/an/an/an/a
The German University in Cairo
Curated by ChEMBL
Assay Description
Displacement of [3H]strychnine from recombinant human glycine receptor alpha 1 expressed in HEK293 cell membranes after 30 mins by liquid scintillati...
J Nat Prod 79: 2997-3005 (2016)
BindingDB Entry DOI: 10.7270/Q2QZ2D66
Glycine receptor (alpha-1/beta)
(Homo sapiens (Human))
BDBM50232885
(CHEMBL4089150)
Show SMILES [H][C@]12C[C@@]3([H])C4=CCO[C@@]5([H])\C(=N/O)C(=O)N6c7ccccc7[C@@]1(CCN2C4)[C@]6([H])[C@@]35[H] |r,c:5|
Show InChI InChI=1S/C21H21N3O3/c25-20-17(22-26)18-16-12-9-15-21(6-7-23(15)10-11(12)5-8-27-18)13-3-1-2-4-14(13)24(20)19(16)21/h1-5,12,15-16,18-19,26H,6-10H2/b22-17+/t12-,15-,16-,18+,19-,21+/m0/s1
n/an/a 210n/an/an/an/an/an/a
The German University in Cairo
Curated by ChEMBL
Assay Description
Antagonist activity at recombinant human glycine receptor alpha 1 beta expressed in human tsA201 cells assessed as inhibition of glycine-induced rece...
J Nat Prod 79: 2997-3005 (2016)
BindingDB Entry DOI: 10.7270/Q2QZ2D66
Glycine receptor subunit alpha-1
(Homo sapiens (Human))
BDBM50232885
(CHEMBL4089150)
Show SMILES [H][C@]12C[C@@]3([H])C4=CCO[C@@]5([H])\C(=N/O)C(=O)N6c7ccccc7[C@@]1(CCN2C4)[C@]6([H])[C@@]35[H] |r,c:5|
Show InChI InChI=1S/C21H21N3O3/c25-20-17(22-26)18-16-12-9-15-21(6-7-23(15)10-11(12)5-8-27-18)13-3-1-2-4-14(13)24(20)19(16)21/h1-5,12,15-16,18-19,26H,6-10H2/b22-17+/t12-,15-,16-,18+,19-,21+/m0/s1
n/an/a 82n/an/an/an/an/an/a
The German University in Cairo
Curated by ChEMBL
Assay Description
Antagonist activity at recombinant human glycine receptor alpha 1 expressed in HEK293 cells assessed as inhibition of glycine-induced current at -50 ...
J Nat Prod 79: 2997-3005 (2016)
BindingDB Entry DOI: 10.7270/Q2QZ2D66
Glycine receptor subunit alpha-1
(Homo sapiens (Human))
BDBM50232885
(CHEMBL4089150)
Show SMILES [H][C@]12C[C@@]3([H])C4=CCO[C@@]5([H])\C(=N/O)C(=O)N6c7ccccc7[C@@]1(CCN2C4)[C@]6([H])[C@@]35[H] |r,c:5|
Show InChI InChI=1S/C21H21N3O3/c25-20-17(22-26)18-16-12-9-15-21(6-7-23(15)10-11(12)5-8-27-18)13-3-1-2-4-14(13)24(20)19(16)21/h1-5,12,15-16,18-19,26H,6-10H2/b22-17+/t12-,15-,16-,18+,19-,21+/m0/s1
n/an/a 98n/an/an/an/an/an/a
The German University in Cairo
Curated by ChEMBL
Assay Description
Antagonist activity at recombinant human glycine receptor alpha 1 expressed in human tsA201 cells assessed as inhibition of glycine-induced receptor ...
J Nat Prod 79: 2997-3005 (2016)
BindingDB Entry DOI: 10.7270/Q2QZ2D66
Glycine receptor (alpha-1/beta)
(Homo sapiens (Human))
BDBM50232885
(CHEMBL4089150)
Show SMILES [H][C@]12C[C@@]3([H])C4=CCO[C@@]5([H])\C(=N/O)C(=O)N6c7ccccc7[C@@]1(CCN2C4)[C@]6([H])[C@@]35[H] |r,c:5|
Show InChI InChI=1S/C21H21N3O3/c25-20-17(22-26)18-16-12-9-15-21(6-7-23(15)10-11(12)5-8-27-18)13-3-1-2-4-14(13)24(20)19(16)21/h1-5,12,15-16,18-19,26H,6-10H2/b22-17+/t12-,15-,16-,18+,19-,21+/m0/s1
n/an/a 80n/an/an/an/an/an/a
The German University in Cairo
Curated by ChEMBL
Assay Description
Antagonist activity at recombinant human glycine receptor alpha 1 beta expressed in HEK293 cells assessed as inhibition of glycine-induced current at...
J Nat Prod 79: 2997-3005 (2016)
BindingDB Entry DOI: 10.7270/Q2QZ2D66
Glycine receptor (alpha-1/beta)
(Homo sapiens (Human))
BDBM50232885
(CHEMBL4089150)
Show SMILES [H][C@]12C[C@@]3([H])C4=CCO[C@@]5([H])\C(=N/O)C(=O)N6c7ccccc7[C@@]1(CCN2C4)[C@]6([H])[C@@]35[H] |r,c:5|
Show InChI InChI=1S/C21H21N3O3/c25-20-17(22-26)18-16-12-9-15-21(6-7-23(15)10-11(12)5-8-27-18)13-3-1-2-4-14(13)24(20)19(16)21/h1-5,12,15-16,18-19,26H,6-10H2/b22-17+/t12-,15-,16-,18+,19-,21+/m0/s1
n/an/a 214n/an/an/an/an/an/a
The German University in Cairo
Curated by ChEMBL
Assay Description
Antagonist activity at recombinant human glycine receptor alpha 1 beta expressed in human tsA201 cells assessed as inhibition of glycine-induced rece...
J Nat Prod 79: 2997-3005 (2016)
BindingDB Entry DOI: 10.7270/Q2QZ2D66
Glycine receptor subunit alpha-1
(Homo sapiens (Human))
BDBM50232885
(CHEMBL4089150)
Show SMILES [H][C@]12C[C@@]3([H])C4=CCO[C@@]5([H])\C(=N/O)C(=O)N6c7ccccc7[C@@]1(CCN2C4)[C@]6([H])[C@@]35[H] |r,c:5|
Show InChI InChI=1S/C21H21N3O3/c25-20-17(22-26)18-16-12-9-15-21(6-7-23(15)10-11(12)5-8-27-18)13-3-1-2-4-14(13)24(20)19(16)21/h1-5,12,15-16,18-19,26H,6-10H2/b22-17+/t12-,15-,16-,18+,19-,21+/m0/s1
n/an/a 97n/an/an/an/an/an/a
The German University in Cairo
Curated by ChEMBL
Assay Description
Antagonist activity at recombinant human glycine receptor alpha 1 expressed in human tsA201 cells assessed as inhibition of glycine-induced receptor ...
J Nat Prod 79: 2997-3005 (2016)
BindingDB Entry DOI: 10.7270/Q2QZ2D66