BDBM50232888 CHEMBL4096857
SMILES: [H][C@]12C[C@@]3([H])C4=CCO[C@@]5([H])CC(=O)N6c7ccc(NC(=O)CC)cc7[C@@]1(CCN2C4)[C@]6([H])[C@@]35[H]
InChI Key: InChIKey=BNLMIPXTXOQLRY-VKEHPUIKSA-N
Data: 1 KI  6 IC50
Activity Spreadsheet -- Enzyme Inhibition Constant Data from BindingDB
Found 7 hits for monomerid = 50232888
Trg + Lig
Ki
nM
ΔG°
kcal/mole
IC50
nM
Kd
nM
EC50/IC50
nM
koff
s-1
kon
M-1s-1
pHTemp
°C
Glycine receptor subunit alpha-1
(Homo sapiens (Human))
BDBM50232888
(CHEMBL4096857)
Show SMILES [H][C@]12C[C@@]3([H])C4=CCO[C@@]5([H])CC(=O)N6c7ccc(NC(=O)CC)cc7[C@@]1(CCN2C4)[C@]6([H])[C@@]35[H] |r,c:5|
Show InChI InChI=1S/C24H27N3O3/c1-2-20(28)25-14-3-4-17-16(9-14)24-6-7-26-12-13-5-8-30-18-11-21(29)27(17)23(24)22(18)15(13)10-19(24)26/h3-5,9,15,18-19,22-23H,2,6-8,10-12H2,1H3,(H,25,28)/t15-,18-,19-,22-,23-,24+/m0/s1
67n/an/an/an/an/an/an/an/a
The German University in Cairo
Curated by ChEMBL
Assay Description
Displacement of [3H]strychnine from recombinant human glycine receptor alpha 1 expressed in HEK293 cell membranes after 30 mins by liquid scintillati...
J Nat Prod 79: 2997-3005 (2016)
BindingDB Entry DOI: 10.7270/Q2QZ2D66
Glycine receptor (alpha-1/beta)
(Homo sapiens (Human))
BDBM50232888
(CHEMBL4096857)
Show SMILES [H][C@]12C[C@@]3([H])C4=CCO[C@@]5([H])CC(=O)N6c7ccc(NC(=O)CC)cc7[C@@]1(CCN2C4)[C@]6([H])[C@@]35[H] |r,c:5|
Show InChI InChI=1S/C24H27N3O3/c1-2-20(28)25-14-3-4-17-16(9-14)24-6-7-26-12-13-5-8-30-18-11-21(29)27(17)23(24)22(18)15(13)10-19(24)26/h3-5,9,15,18-19,22-23H,2,6-8,10-12H2,1H3,(H,25,28)/t15-,18-,19-,22-,23-,24+/m0/s1
n/an/a 940n/an/an/an/an/an/a
The German University in Cairo
Curated by ChEMBL
Assay Description
Antagonist activity at recombinant human glycine receptor alpha 1 beta expressed in human tsA201 cells assessed as inhibition of glycine-induced rece...
J Nat Prod 79: 2997-3005 (2016)
BindingDB Entry DOI: 10.7270/Q2QZ2D66
Glycine receptor subunit alpha-1
(Homo sapiens (Human))
BDBM50232888
(CHEMBL4096857)
Show SMILES [H][C@]12C[C@@]3([H])C4=CCO[C@@]5([H])CC(=O)N6c7ccc(NC(=O)CC)cc7[C@@]1(CCN2C4)[C@]6([H])[C@@]35[H] |r,c:5|
Show InChI InChI=1S/C24H27N3O3/c1-2-20(28)25-14-3-4-17-16(9-14)24-6-7-26-12-13-5-8-30-18-11-21(29)27(17)23(24)22(18)15(13)10-19(24)26/h3-5,9,15,18-19,22-23H,2,6-8,10-12H2,1H3,(H,25,28)/t15-,18-,19-,22-,23-,24+/m0/s1
n/an/a 537n/an/an/an/an/an/a
The German University in Cairo
Curated by ChEMBL
Assay Description
Antagonist activity at recombinant human glycine receptor alpha 1 expressed in human tsA201 cells assessed as inhibition of glycine-induced receptor ...
J Nat Prod 79: 2997-3005 (2016)
BindingDB Entry DOI: 10.7270/Q2QZ2D66
Glycine receptor subunit alpha-1
(Homo sapiens (Human))
BDBM50232888
(CHEMBL4096857)
Show SMILES [H][C@]12C[C@@]3([H])C4=CCO[C@@]5([H])CC(=O)N6c7ccc(NC(=O)CC)cc7[C@@]1(CCN2C4)[C@]6([H])[C@@]35[H] |r,c:5|
Show InChI InChI=1S/C24H27N3O3/c1-2-20(28)25-14-3-4-17-16(9-14)24-6-7-26-12-13-5-8-30-18-11-21(29)27(17)23(24)22(18)15(13)10-19(24)26/h3-5,9,15,18-19,22-23H,2,6-8,10-12H2,1H3,(H,25,28)/t15-,18-,19-,22-,23-,24+/m0/s1
n/an/a 201n/an/an/an/an/an/a
The German University in Cairo
Curated by ChEMBL
Assay Description
Antagonist activity at recombinant human glycine receptor alpha 1 expressed in HEK293 cells assessed as inhibition of glycine-induced current at -50 ...
J Nat Prod 79: 2997-3005 (2016)
BindingDB Entry DOI: 10.7270/Q2QZ2D66
Glycine receptor subunit alpha-1
(Homo sapiens (Human))
BDBM50232888
(CHEMBL4096857)
Show SMILES [H][C@]12C[C@@]3([H])C4=CCO[C@@]5([H])CC(=O)N6c7ccc(NC(=O)CC)cc7[C@@]1(CCN2C4)[C@]6([H])[C@@]35[H] |r,c:5|
Show InChI InChI=1S/C24H27N3O3/c1-2-20(28)25-14-3-4-17-16(9-14)24-6-7-26-12-13-5-8-30-18-11-21(29)27(17)23(24)22(18)15(13)10-19(24)26/h3-5,9,15,18-19,22-23H,2,6-8,10-12H2,1H3,(H,25,28)/t15-,18-,19-,22-,23-,24+/m0/s1
n/an/a 540n/an/an/an/an/an/a
The German University in Cairo
Curated by ChEMBL
Assay Description
Antagonist activity at recombinant human glycine receptor alpha 1 expressed in human tsA201 cells assessed as inhibition of glycine-induced receptor ...
J Nat Prod 79: 2997-3005 (2016)
BindingDB Entry DOI: 10.7270/Q2QZ2D66
Glycine receptor (alpha-1/beta)
(Homo sapiens (Human))
BDBM50232888
(CHEMBL4096857)
Show SMILES [H][C@]12C[C@@]3([H])C4=CCO[C@@]5([H])CC(=O)N6c7ccc(NC(=O)CC)cc7[C@@]1(CCN2C4)[C@]6([H])[C@@]35[H] |r,c:5|
Show InChI InChI=1S/C24H27N3O3/c1-2-20(28)25-14-3-4-17-16(9-14)24-6-7-26-12-13-5-8-30-18-11-21(29)27(17)23(24)22(18)15(13)10-19(24)26/h3-5,9,15,18-19,22-23H,2,6-8,10-12H2,1H3,(H,25,28)/t15-,18-,19-,22-,23-,24+/m0/s1
n/an/a 311n/an/an/an/an/an/a
The German University in Cairo
Curated by ChEMBL
Assay Description
Antagonist activity at recombinant human glycine receptor alpha 1 beta expressed in HEK293 cells assessed as inhibition of glycine-induced current at...
J Nat Prod 79: 2997-3005 (2016)
BindingDB Entry DOI: 10.7270/Q2QZ2D66
Glycine receptor (alpha-1/beta)
(Homo sapiens (Human))
BDBM50232888
(CHEMBL4096857)
Show SMILES [H][C@]12C[C@@]3([H])C4=CCO[C@@]5([H])CC(=O)N6c7ccc(NC(=O)CC)cc7[C@@]1(CCN2C4)[C@]6([H])[C@@]35[H] |r,c:5|
Show InChI InChI=1S/C24H27N3O3/c1-2-20(28)25-14-3-4-17-16(9-14)24-6-7-26-12-13-5-8-30-18-11-21(29)27(17)23(24)22(18)15(13)10-19(24)26/h3-5,9,15,18-19,22-23H,2,6-8,10-12H2,1H3,(H,25,28)/t15-,18-,19-,22-,23-,24+/m0/s1
n/an/a 933n/an/an/an/an/an/a
The German University in Cairo
Curated by ChEMBL
Assay Description
Antagonist activity at recombinant human glycine receptor alpha 1 beta expressed in human tsA201 cells assessed as inhibition of glycine-induced rece...
J Nat Prod 79: 2997-3005 (2016)
BindingDB Entry DOI: 10.7270/Q2QZ2D66