BDBM50233030 (S)-4-methyl-2-[(S)-2,2,2-trifluoro-1-(4'-methanesulfonyl-biphenyl-4-yl)-ethylamino]-pentanoic acid ((R/S)-cyano-phenyl-methyl)-amide::CHEMBL252179
SMILES: CC(C)C[C@H](N[C@@H](c1ccc(cc1)-c1ccc(cc1)S(C)(=O)=O)C(F)(F)F)C(=O)NC(C#N)c1ccccc1
InChI Key: InChIKey=DAJBUTDDFYLLSS-LLOGBAKRSA-N
Data: 4 IC50
Activity Spreadsheet -- Enzyme Inhibition Constant Data from BindingDB
Found 4 hits for monomerid = 50233030
Trg + Lig
Ki
nM
ΔG°
kcal/mole
IC50
nM
Kd
nM
EC50/IC50
nM
koff
s-1
kon
M-1s-1
pHTemp
°C
Cathepsin S
(Homo sapiens (Human))
BDBM50233030
((S)-4-methyl-2-[(S)-2,2,2-trifluoro-1-(4'-methanes...)
Show SMILES CC(C)C[C@H](N[C@@H](c1ccc(cc1)-c1ccc(cc1)S(C)(=O)=O)C(F)(F)F)C(=O)NC(C#N)c1ccccc1 |w:30.31|
Show InChI InChI=1S/C29H30F3N3O3S/c1-19(2)17-25(28(36)35-26(18-33)22-7-5-4-6-8-22)34-27(29(30,31)32)23-11-9-20(10-12-23)21-13-15-24(16-14-21)39(3,37)38/h4-16,19,25-27,34H,17H2,1-3H3,(H,35,36)/t25-,26?,27-/m0/s1
Reactome pathway
n/an/a 217n/an/an/an/an/an/a
Merck Frosst Centre for Therapeutic Research
Curated by ChEMBL
Assay Description
Inhibition of cathepsin S
Bioorg Med Chem Lett 18: 923-8 (2008)
Article DOI: 10.1016/j.bmcl.2007.12.047
BindingDB Entry DOI: 10.7270/Q21J9BM2
Cathepsin K
(Homo sapiens (Human))
BDBM50233030
((S)-4-methyl-2-[(S)-2,2,2-trifluoro-1-(4'-methanes...)
Show SMILES CC(C)C[C@H](N[C@@H](c1ccc(cc1)-c1ccc(cc1)S(C)(=O)=O)C(F)(F)F)C(=O)NC(C#N)c1ccccc1 |w:30.31|
Show InChI InChI=1S/C29H30F3N3O3S/c1-19(2)17-25(28(36)35-26(18-33)22-7-5-4-6-8-22)34-27(29(30,31)32)23-11-9-20(10-12-23)21-13-15-24(16-14-21)39(3,37)38/h4-16,19,25-27,34H,17H2,1-3H3,(H,35,36)/t25-,26?,27-/m0/s1
Reactome pathway
n/an/a 0.600n/an/an/an/an/an/a
Merck Frosst Centre for Therapeutic Research
Curated by ChEMBL
Assay Description
Inhibition of humanized rabbit cathepsin K
Bioorg Med Chem Lett 18: 923-8 (2008)
Article DOI: 10.1016/j.bmcl.2007.12.047
BindingDB Entry DOI: 10.7270/Q21J9BM2
Cathepsin B
(Homo sapiens (Human))
BDBM50233030
((S)-4-methyl-2-[(S)-2,2,2-trifluoro-1-(4'-methanes...)
Show SMILES CC(C)C[C@H](N[C@@H](c1ccc(cc1)-c1ccc(cc1)S(C)(=O)=O)C(F)(F)F)C(=O)NC(C#N)c1ccccc1 |w:30.31|
Show InChI InChI=1S/C29H30F3N3O3S/c1-19(2)17-25(28(36)35-26(18-33)22-7-5-4-6-8-22)34-27(29(30,31)32)23-11-9-20(10-12-23)21-13-15-24(16-14-21)39(3,37)38/h4-16,19,25-27,34H,17H2,1-3H3,(H,35,36)/t25-,26?,27-/m0/s1
Reactome pathway
n/an/a 3.45E+3n/an/an/an/an/an/a
Merck Frosst Centre for Therapeutic Research
Curated by ChEMBL
Assay Description
Inhibition of cathepsin B
Bioorg Med Chem Lett 18: 923-8 (2008)
Article DOI: 10.1016/j.bmcl.2007.12.047
BindingDB Entry DOI: 10.7270/Q21J9BM2
Procathepsin L
(Homo sapiens (Human))
BDBM50233030
((S)-4-methyl-2-[(S)-2,2,2-trifluoro-1-(4'-methanes...)
Show SMILES CC(C)C[C@H](N[C@@H](c1ccc(cc1)-c1ccc(cc1)S(C)(=O)=O)C(F)(F)F)C(=O)NC(C#N)c1ccccc1 |w:30.31|
Show InChI InChI=1S/C29H30F3N3O3S/c1-19(2)17-25(28(36)35-26(18-33)22-7-5-4-6-8-22)34-27(29(30,31)32)23-11-9-20(10-12-23)21-13-15-24(16-14-21)39(3,37)38/h4-16,19,25-27,34H,17H2,1-3H3,(H,35,36)/t25-,26?,27-/m0/s1
Reactome pathway
n/an/a 667n/an/an/an/an/an/a
Merck Frosst Centre for Therapeutic Research
Curated by ChEMBL
Assay Description
Inhibition of cathepsin L
Bioorg Med Chem Lett 18: 923-8 (2008)
Article DOI: 10.1016/j.bmcl.2007.12.047
BindingDB Entry DOI: 10.7270/Q21J9BM2