BDBM50233203 CHEMBL4098867
SMILES: Cc1cc(F)ccc1C(=O)c1sc2cc(O)ccc2c1Oc1ccc(\C=C\C(O)=O)cc1
InChI Key: InChIKey=RBGNZGYQQUPXJP-NYYWCZLTSA-N
Data: 1 KI  1 IC50  1 EC50
Activity Spreadsheet -- Enzyme Inhibition Constant Data from BindingDB
Found 3 hits for monomerid = 50233203
Trg + Lig
Ki
nM
ΔG°
kcal/mole
IC50
nM
Kd
nM
EC50/IC50
nM
koff
s-1
kon
M-1s-1
pHTemp
°C
Estrogen receptor
(Homo sapiens (Human))
BDBM50233203
(CHEMBL4098867)
Show SMILES Cc1cc(F)ccc1C(=O)c1sc2cc(O)ccc2c1Oc1ccc(\C=C\C(O)=O)cc1
Show InChI InChI=1S/C25H17FO5S/c1-14-12-16(26)5-9-19(14)23(30)25-24(20-10-6-17(27)13-21(20)32-25)31-18-7-2-15(3-8-18)4-11-22(28)29/h2-13,27H,1H3,(H,28,29)/b11-4+
0.650n/an/an/an/an/an/an/an/a
University of Illinois College of Pharmacy
Curated by ChEMBL
Assay Description
Displacement of [3H]estradiol from full length recombinant human ESR1 expressed in insect cells by radiometric assay
J Med Chem 60: 1325-1342 (2017)
BindingDB Entry DOI: 10.7270/Q29P33WB
Estrogen receptor
(Homo sapiens (Human))
BDBM50233203
(CHEMBL4098867)
Show SMILES Cc1cc(F)ccc1C(=O)c1sc2cc(O)ccc2c1Oc1ccc(\C=C\C(O)=O)cc1
Show InChI InChI=1S/C25H17FO5S/c1-14-12-16(26)5-9-19(14)23(30)25-24(20-10-6-17(27)13-21(20)32-25)31-18-7-2-15(3-8-18)4-11-22(28)29/h2-13,27H,1H3,(H,28,29)/b11-4+
n/an/a 8.80n/an/an/an/an/an/a
University of Illinois College of Pharmacy
Curated by ChEMBL
Assay Description
Antagonist activity at ERalpha in tamoxifen-sensitive human MCF7:WS8 cells assessed as inhibition of estradiol-induced response after 18 hrs by lucif...
J Med Chem 60: 1325-1342 (2017)
BindingDB Entry DOI: 10.7270/Q29P33WB
Estrogen receptor
(Homo sapiens (Human))
BDBM50233203
(CHEMBL4098867)
Show SMILES Cc1cc(F)ccc1C(=O)c1sc2cc(O)ccc2c1Oc1ccc(\C=C\C(O)=O)cc1
Show InChI InChI=1S/C25H17FO5S/c1-14-12-16(26)5-9-19(14)23(30)25-24(20-10-6-17(27)13-21(20)32-25)31-18-7-2-15(3-8-18)4-11-22(28)29/h2-13,27H,1H3,(H,28,29)/b11-4+
n/an/an/an/a 0.710n/an/an/an/a
University of Illinois College of Pharmacy
Curated by ChEMBL
Assay Description
Induction of ERalpha degradation in tamoxifen-sensitive human MCF7:WS8 cells after 24 hrs by CellTag 700 staining based In-cell western assay
J Med Chem 60: 1325-1342 (2017)
BindingDB Entry DOI: 10.7270/Q29P33WB