BDBM50233240 CHEMBL4065561
SMILES: CN1c2ccccc2OC[C@H](NC(=O)c2ncn(Cc3ccccc3)n2)C1=O
InChI Key: InChIKey=OJLFTGVMYJICFC-HNNXBMFYSA-N
Data: 2 IC50
Activity Spreadsheet -- Enzyme Inhibition Constant Data from BindingDB
Found 2 hits for monomerid = 50233240
Trg + Lig
Ki
nM
ΔG°
kcal/mole
IC50
nM
Kd
nM
EC50/IC50
nM
koff
s-1
kon
M-1s-1
pHTemp
°C
Receptor-interacting serine/threonine-protein kinase 1
(Homo sapiens (Human))
BDBM50233240
(CHEMBL4065561)
Show SMILES CN1c2ccccc2OC[C@H](NC(=O)c2ncn(Cc3ccccc3)n2)C1=O |r|
Show InChI InChI=1S/C20H19N5O3/c1-24-16-9-5-6-10-17(16)28-12-15(20(24)27)22-19(26)18-21-13-25(23-18)11-14-7-3-2-4-8-14/h2-10,13,15H,11-12H2,1H3,(H,22,26)/t15-/m0/s1
n/an/a 1.60n/an/an/an/an/an/a
Queen Mary University of London
Curated by ChEMBL
Assay Description
Inhibition of RIP1 in human U937 cells assessed as reduction in TNFalpha/QVD-Oph-induced necrosis after 24 hrs by Cell Titer-Glo luminescent cell via...
J Med Chem 60: 1247-1261 (2017)
BindingDB Entry DOI: 10.7270/Q2SQ92NR
Receptor-interacting serine/threonine-protein kinase 1
(Homo sapiens (Human))
BDBM50233240
(CHEMBL4065561)
Show SMILES CN1c2ccccc2OC[C@H](NC(=O)c2ncn(Cc3ccccc3)n2)C1=O |r|
Show InChI InChI=1S/C20H19N5O3/c1-24-16-9-5-6-10-17(16)28-12-15(20(24)27)22-19(26)18-21-13-25(23-18)11-14-7-3-2-4-8-14/h2-10,13,15H,11-12H2,1H3,(H,22,26)/t15-/m0/s1
n/an/a 0.630n/an/an/an/an/an/a
Queen Mary University of London
Curated by ChEMBL
Assay Description
Inhibition of human RIP1 (1 to 375 residues) expressed in baculovirus infected insect cells preincubated for 1 hr followed by ATP addition measured a...
J Med Chem 60: 1247-1261 (2017)
BindingDB Entry DOI: 10.7270/Q2SQ92NR