BDBM50233384 CHEMBL4105560
SMILES: CS(=O)(=O)NC(=O)[C@H]1CCC[C@H](C1)c1nc(-c2ccc(cc2)C(=O)Nc2cc(ccn2)C(F)(F)F)c2c(N)nccn12
InChI Key: InChIKey=UTFDTGYMNKCNRG-MSOLQXFVSA-N
Data: 2 IC50
Activity Spreadsheet -- Enzyme Inhibition Constant Data from BindingDB
Found 2 hits for monomerid = 50233384
Trg + Lig
Ki
nM
ΔG°
kcal/mole
IC50
nM
Kd
nM
EC50/IC50
nM
koff
s-1
kon
M-1s-1
pHTemp
°C
Tyrosine-protein kinase BTK
(Homo sapiens (Human))
BDBM50233384
(CHEMBL4105560)
Show SMILES CS(=O)(=O)NC(=O)[C@H]1CCC[C@H](C1)c1nc(-c2ccc(cc2)C(=O)Nc2cc(ccn2)C(F)(F)F)c2c(N)nccn12 |r|
Show InChI InChI=1S/C27H26F3N7O4S/c1-42(40,41)36-26(39)18-4-2-3-17(13-18)24-35-21(22-23(31)33-11-12-37(22)24)15-5-7-16(8-6-15)25(38)34-20-14-19(9-10-32-20)27(28,29)30/h5-12,14,17-18H,2-4,13H2,1H3,(H2,31,33)(H,36,39)(H,32,34,38)/t17-,18+/m1/s1
NCI pathway
Reactome pathway
n/an/a 648n/an/an/an/an/an/a
Merck & Co Inc
Curated by ChEMBL
Assay Description
Inhibition of BTK in human PBMC
Bioorg Med Chem Lett 27: 1471-1477 (2017)
BindingDB Entry DOI: 10.7270/Q20867K5
Tyrosine-protein kinase BTK
(Homo sapiens (Human))
BDBM50233384
(CHEMBL4105560)
Show SMILES CS(=O)(=O)NC(=O)[C@H]1CCC[C@H](C1)c1nc(-c2ccc(cc2)C(=O)Nc2cc(ccn2)C(F)(F)F)c2c(N)nccn12 |r|
Show InChI InChI=1S/C27H26F3N7O4S/c1-42(40,41)36-26(39)18-4-2-3-17(13-18)24-35-21(22-23(31)33-11-12-37(22)24)15-5-7-16(8-6-15)25(38)34-20-14-19(9-10-32-20)27(28,29)30/h5-12,14,17-18H,2-4,13H2,1H3,(H2,31,33)(H,36,39)(H,32,34,38)/t17-,18+/m1/s1
NCI pathway
Reactome pathway
n/an/a 1.20n/an/an/an/an/an/a
Merck & Co Inc
Curated by ChEMBL
Assay Description
Inhibition of 6-His-tagged recombinant full length BTK (unknown origin) expressed in baculovirus-transfected Sf9 cells using Biotin-EQEDEPEGDYFEWLE-N...
Bioorg Med Chem Lett 27: 1471-1477 (2017)
BindingDB Entry DOI: 10.7270/Q20867K5