BDBM50233386 CHEMBL4100424
SMILES: Nc1nccn2c(nc(-c3ccc(cc3)C(=O)Nc3cc(ccn3)C(F)(F)F)c12)[C@@H]1CCC[C@@H](C1)c1nnc[nH]1
InChI Key: InChIKey=DXCPJOXOIRMELN-ZWKOTPCHSA-N
Data: 2 IC50
Activity Spreadsheet -- Enzyme Inhibition Constant Data from BindingDB
Found 2 hits for monomerid = 50233386
Trg + Lig
Ki
nM
ΔG°
kcal/mole
IC50
nM
Kd
nM
EC50/IC50
nM
koff
s-1
kon
M-1s-1
pHTemp
°C
Tyrosine-protein kinase BTK
(Homo sapiens (Human))
BDBM50233386
(CHEMBL4100424)
Show SMILES Nc1nccn2c(nc(-c3ccc(cc3)C(=O)Nc3cc(ccn3)C(F)(F)F)c12)[C@@H]1CCC[C@@H](C1)c1nnc[nH]1 |r|
Show InChI InChI=1S/C27H24F3N9O/c28-27(29,30)19-8-9-32-20(13-19)36-26(40)16-6-4-15(5-7-16)21-22-23(31)33-10-11-39(22)25(37-21)18-3-1-2-17(12-18)24-34-14-35-38-24/h4-11,13-14,17-18H,1-3,12H2,(H2,31,33)(H,32,36,40)(H,34,35,38)/t17-,18+/m0/s1
NCI pathway
Reactome pathway
n/an/a 17n/an/an/an/an/an/a
Merck & Co Inc
Curated by ChEMBL
Assay Description
Inhibition of BTK in human PBMC
Bioorg Med Chem Lett 27: 1471-1477 (2017)
BindingDB Entry DOI: 10.7270/Q20867K5
Tyrosine-protein kinase BTK
(Homo sapiens (Human))
BDBM50233386
(CHEMBL4100424)
Show SMILES Nc1nccn2c(nc(-c3ccc(cc3)C(=O)Nc3cc(ccn3)C(F)(F)F)c12)[C@@H]1CCC[C@@H](C1)c1nnc[nH]1 |r|
Show InChI InChI=1S/C27H24F3N9O/c28-27(29,30)19-8-9-32-20(13-19)36-26(40)16-6-4-15(5-7-16)21-22-23(31)33-10-11-39(22)25(37-21)18-3-1-2-17(12-18)24-34-14-35-38-24/h4-11,13-14,17-18H,1-3,12H2,(H2,31,33)(H,32,36,40)(H,34,35,38)/t17-,18+/m0/s1
NCI pathway
Reactome pathway
n/an/a 0.300n/an/an/an/an/an/a
Merck & Co Inc
Curated by ChEMBL
Assay Description
Inhibition of 6-His-tagged recombinant full length BTK (unknown origin) expressed in baculovirus-transfected Sf9 cells using Biotin-EQEDEPEGDYFEWLE-N...
Bioorg Med Chem Lett 27: 1471-1477 (2017)
BindingDB Entry DOI: 10.7270/Q20867K5