BDBM50233521 CHEMBL3975922
SMILES: Cc1c(CC(O)=O)c2cccnc2n1Cc1ccc(cc1C)S(C)(=O)=O
InChI Key: InChIKey=QEIQIUMAMIISFB-UHFFFAOYSA-N
Data: 1 KI  2 IC50
Activity Spreadsheet -- Enzyme Inhibition Constant Data from BindingDB
Found 3 hits for monomerid = 50233521
Trg + Lig
Ki
nM
ΔG°
kcal/mole
IC50
nM
Kd
nM
EC50/IC50
nM
koff
s-1
kon
M-1s-1
pHTemp
°C
G protein-coupled receptor 44
(Homo sapiens (Human))
BDBM50233521
(CHEMBL3975922)
Show SMILES Cc1c(CC(O)=O)c2cccnc2n1Cc1ccc(cc1C)S(C)(=O)=O
Show InChI InChI=1S/C19H20N2O4S/c1-12-9-15(26(3,24)25)7-6-14(12)11-21-13(2)17(10-18(22)23)16-5-4-8-20-19(16)21/h4-9H,10-11H2,1-3H3,(H,22,23)
Reactome pathway
31n/an/an/an/an/an/an/an/a
Novartis Institutes for Biomedical Research
Curated by ChEMBL
Assay Description
Displacement of [3H]PGD2 from human DP2 receptor expressed in CHO cell membranes after 60 mins by scintillation proximity assay
ACS Med Chem Lett 8: 582-586 (2017)
BindingDB Entry DOI: 10.7270/Q2TH8PXN
G protein-coupled receptor 44
(Homo sapiens (Human))
BDBM50233521
(CHEMBL3975922)
Show SMILES Cc1c(CC(O)=O)c2cccnc2n1Cc1ccc(cc1C)S(C)(=O)=O
Show InChI InChI=1S/C19H20N2O4S/c1-12-9-15(26(3,24)25)7-6-14(12)11-21-13(2)17(10-18(22)23)16-5-4-8-20-19(16)21/h4-9H,10-11H2,1-3H3,(H,22,23)
Reactome pathway
n/an/a 32n/an/an/an/an/an/a
Novartis Institutes for Biomedical Research
Curated by ChEMBL
Assay Description
Antagonist activity at DP2 receptor in human whole assessed as inhibition of DK-PGD2-induced eosinophils shape change preincubated for 5 mins followe...
ACS Med Chem Lett 8: 582-586 (2017)
BindingDB Entry DOI: 10.7270/Q2TH8PXN
G protein-coupled receptor 44
(Homo sapiens (Human))
BDBM50233521
(CHEMBL3975922)
Show SMILES Cc1c(CC(O)=O)c2cccnc2n1Cc1ccc(cc1C)S(C)(=O)=O
Show InChI InChI=1S/C19H20N2O4S/c1-12-9-15(26(3,24)25)7-6-14(12)11-21-13(2)17(10-18(22)23)16-5-4-8-20-19(16)21/h4-9H,10-11H2,1-3H3,(H,22,23)
Reactome pathway
n/an/a 4n/an/an/an/an/an/a
Novartis Institutes for Biomedical Research
Curated by ChEMBL
Assay Description
Antagonist activity at DP2 receptor in human isolated eosinophils assessed as inhibition of DK-PGD2-induced shape change preincubated for 5 mins foll...
ACS Med Chem Lett 8: 582-586 (2017)
BindingDB Entry DOI: 10.7270/Q2TH8PXN