BDBM50233565 2-hydroxy-N,N-dimethyl-3-(2-(1-(oxazol-2-yl)propylamino)-3,4-dioxocyclobut-1-enylamino)benzamide::CHEMBL430116
SMILES: CCC(Nc1c(Nc2cccc(C(=O)N(C)C)c2O)c(=O)c1=O)c1ncco1
InChI Key: InChIKey=GAZMRTOTNDECNS-UHFFFAOYSA-N
Data: 2 IC50
Activity Spreadsheet -- Enzyme Inhibition Constant Data from BindingDB
Found 2 hits for monomerid = 50233565
Trg + Lig
Ki
nM
ΔG°
kcal/mole
IC50
nM
Kd
nM
EC50/IC50
nM
koff
s-1
kon
M-1s-1
pHTemp
°C
C-X-C chemokine receptor type 1
(Homo sapiens (Human))
BDBM50233565
(2-hydroxy-N,N-dimethyl-3-(2-(1-(oxazol-2-yl)propyl...)
Show SMILES CCC(Nc1c(Nc2cccc(C(=O)N(C)C)c2O)c(=O)c1=O)c1ncco1 |w:2.2|
Show InChI InChI=1S/C19H20N4O5/c1-4-11(18-20-8-9-28-18)21-13-14(17(26)16(13)25)22-12-7-5-6-10(15(12)24)19(27)23(2)3/h5-9,11,21-22,24H,4H2,1-3H3
n/an/a 795n/an/an/an/an/an/a
Schering-Plough Research Institute
Curated by ChEMBL
Assay Description
Inhibition of CXCR1
Bioorg Med Chem Lett 18: 1318-22 (2008)
Article DOI: 10.1016/j.bmcl.2008.01.024
BindingDB Entry DOI: 10.7270/Q2PV6K33
C-X-C chemokine receptor type 2
(Homo sapiens (Human))
BDBM50233565
(2-hydroxy-N,N-dimethyl-3-(2-(1-(oxazol-2-yl)propyl...)
Show SMILES CCC(Nc1c(Nc2cccc(C(=O)N(C)C)c2O)c(=O)c1=O)c1ncco1 |w:2.2|
Show InChI InChI=1S/C19H20N4O5/c1-4-11(18-20-8-9-28-18)21-13-14(17(26)16(13)25)22-12-7-5-6-10(15(12)24)19(27)23(2)3/h5-9,11,21-22,24H,4H2,1-3H3
Reactome pathway
n/an/a 8.60n/an/an/an/an/an/a
Schering-Plough Research Institute
Curated by ChEMBL
Assay Description
Inhibition of CXCR2
Bioorg Med Chem Lett 18: 1318-22 (2008)
Article DOI: 10.1016/j.bmcl.2008.01.024
BindingDB Entry DOI: 10.7270/Q2PV6K33