BDBM50233577 3-(2-(1-(4-bromofuran-2-yl)propylamino)-3,4-dioxocyclobut-1-enylamino)-2-hydroxy-N,N-dimethylbenzamide::CHEMBL253498
SMILES: CCC(Nc1c(Nc2cccc(C(=O)N(C)C)c2O)c(=O)c1=O)c1cc(Br)co1
InChI Key: InChIKey=UNUGDTFIICVXIP-UHFFFAOYSA-N
Data: 2 IC50
Activity Spreadsheet -- Enzyme Inhibition Constant Data from BindingDB
Found 2 hits for monomerid = 50233577
Trg + Lig
Ki
nM
ΔG°
kcal/mole
IC50
nM
Kd
nM
EC50/IC50
nM
koff
s-1
kon
M-1s-1
pHTemp
°C
C-X-C chemokine receptor type 1
(Homo sapiens (Human))
BDBM50233577
(3-(2-(1-(4-bromofuran-2-yl)propylamino)-3,4-dioxoc...)
Show SMILES CCC(Nc1c(Nc2cccc(C(=O)N(C)C)c2O)c(=O)c1=O)c1cc(Br)co1 |w:2.2|
Show InChI InChI=1S/C20H20BrN3O5/c1-4-12(14-8-10(21)9-29-14)22-15-16(19(27)18(15)26)23-13-7-5-6-11(17(13)25)20(28)24(2)3/h5-9,12,22-23,25H,4H2,1-3H3
n/an/a 93n/an/an/an/an/an/a
Schering-Plough Research Institute
Curated by ChEMBL
Assay Description
Inhibition of CXCR1
Bioorg Med Chem Lett 18: 1318-22 (2008)
Article DOI: 10.1016/j.bmcl.2008.01.024
BindingDB Entry DOI: 10.7270/Q2PV6K33
C-X-C chemokine receptor type 2
(Homo sapiens (Human))
BDBM50233577
(3-(2-(1-(4-bromofuran-2-yl)propylamino)-3,4-dioxoc...)
Show SMILES CCC(Nc1c(Nc2cccc(C(=O)N(C)C)c2O)c(=O)c1=O)c1cc(Br)co1 |w:2.2|
Show InChI InChI=1S/C20H20BrN3O5/c1-4-12(14-8-10(21)9-29-14)22-15-16(19(27)18(15)26)23-13-7-5-6-11(17(13)25)20(28)24(2)3/h5-9,12,22-23,25H,4H2,1-3H3
Reactome pathway
n/an/a 5n/an/an/an/an/an/a
Schering-Plough Research Institute
Curated by ChEMBL
Assay Description
Inhibition of CXCR2
Bioorg Med Chem Lett 18: 1318-22 (2008)
Article DOI: 10.1016/j.bmcl.2008.01.024
BindingDB Entry DOI: 10.7270/Q2PV6K33