BDBM50233718 5-cyano-N-(2-(3-fluoropiperidin-1-yl)-4-(4-methylpiperazin-1-yl)phenyl)furan-2-carboxamide::CHEMBL252633
SMILES: CN1CCN(CC1)c1ccc(NC(=O)c2ccc(o2)C#N)c(c1)N1CCCC(F)C1
InChI Key: InChIKey=ZNOXGGBCSTZRGM-UHFFFAOYSA-N
Data: 1 IC50
Activity Spreadsheet -- Enzyme Inhibition Constant Data from BindingDB
Found 1 hit for monomerid = 50233718
Trg + Lig
Ki
nM
ΔG°
kcal/mole
IC50
nM
Kd
nM
EC50/IC50
nM
koff
s-1
kon
M-1s-1
pHTemp
°C
Macrophage colony stimulating factor receptor
(Homo sapiens (Human))
BDBM50233718
(5-cyano-N-(2-(3-fluoropiperidin-1-yl)-4-(4-methylp...)
Show SMILES CN1CCN(CC1)c1ccc(NC(=O)c2ccc(o2)C#N)c(c1)N1CCCC(F)C1 |w:27.30|
Show InChI InChI=1S/C22H26FN5O2/c1-26-9-11-27(12-10-26)17-4-6-19(20(13-17)28-8-2-3-16(23)15-28)25-22(29)21-7-5-18(14-24)30-21/h4-7,13,16H,2-3,8-12,15H2,1H3,(H,25,29)
n/an/a 6.30n/an/an/an/an/an/a
Johnson & Johnson Pharmaceutical Research & Development
Curated by ChEMBL
Assay Description
Inhibition of human cytoplasmic FMS expressed in Sf9-baculovirus system after 80 mins by fluorescence polarization
Bioorg Med Chem Lett 18: 1642-8 (2008)
Article DOI: 10.1016/j.bmcl.2008.01.059
BindingDB Entry DOI: 10.7270/Q2FB52PS