BDBM50233904 CHEMBL4073581
SMILES: OC(=O)CCCOc1cccc(CNC(=O)c2nc3ccccc3c(=O)[nH]2)c1
InChI Key: InChIKey=FGBGICACEWJGMP-UHFFFAOYSA-N
Data: 1 IC50
Activity Spreadsheet -- Enzyme Inhibition Constant Data from BindingDB
Found 1 hit for monomerid = 50233904
Trg + Lig
Ki
nM
ΔG°
kcal/mole
IC50
nM
Kd
nM
EC50/IC50
nM
koff
s-1
kon
M-1s-1
pHTemp
°C
Collagenase 3
(Homo sapiens (Human))
BDBM50233904
(CHEMBL4073581)
Show SMILES OC(=O)CCCOc1cccc(CNC(=O)c2nc3ccccc3c(=O)[nH]2)c1
Show InChI InChI=1S/C20H19N3O5/c24-17(25)9-4-10-28-14-6-3-5-13(11-14)12-21-20(27)18-22-16-8-2-1-7-15(16)19(26)23-18/h1-3,5-8,11H,4,9-10,12H2,(H,21,27)(H,24,25)(H,22,23,26)
NCI pathway
Reactome pathway
n/an/a 9.40n/an/an/an/an/an/a
Pharmaceutical Company Limited
Curated by ChEMBL
Assay Description
Inhibition of APMA-activated recombinant human MMP-13 using Cy3-PLGLK(Cy5Q)AR-NH2 peptide as substrate measured after 40 mins by spectrofluorimetric ...
J Med Chem 60: 608-626 (2017)
BindingDB Entry DOI: 10.7270/Q2W95CF2