BDBM50233977 CHEMBL4086288
SMILES: CCCCCCCCNc1nc(C)cc(NCCN(C)C)n1
InChI Key: InChIKey=LVKPOVWZTWVEDD-UHFFFAOYSA-N
Data: 1 IC50
Activity Spreadsheet -- Enzyme Inhibition Constant Data from BindingDB
Found 1 hit for monomerid = 50233977
Trg + Lig
Ki
nM
ΔG°
kcal/mole
IC50
nM
Kd
nM
EC50/IC50
nM
koff
s-1
kon
M-1s-1
pHTemp
°C
Dynamin-2
(Homo sapiens (Human))
BDBM50233977
(CHEMBL4086288)
Show SMILES CCCCCCCCNc1nc(C)cc(NCCN(C)C)n1
Show InChI InChI=1S/C17H33N5/c1-5-6-7-8-9-10-11-19-17-20-15(2)14-16(21-17)18-12-13-22(3)4/h14H,5-13H2,1-4H3,(H2,18,19,20,21)
NCI pathway
Reactome pathway
n/an/a 1.03E+4n/an/an/an/an/an/a
The University of Newcastle
Curated by ChEMBL
Assay Description
Inhibition of dynamin 2 in human U2OS cells assessed as reduction in clathrin-mediated endocytosis by measuring transferrin-A594 uptake preincubated ...
J Med Chem 60: 349-361 (2017)
BindingDB Entry DOI: 10.7270/Q27M0B6T