BDBM50234033 CHEMBL4078213
SMILES: Clc1ccccc1OC[C@H]1CCCN1c1ncnc2[nH]cnc12
InChI Key: InChIKey=YJVSNGVKQCPVFF-LLVKDONJSA-N
Data: 1 IC50
Activity Spreadsheet -- Enzyme Inhibition Constant Data from BindingDB
Found 1 hit for monomerid = 50234033
Trg + Lig
Ki
nM
ΔG°
kcal/mole
IC50
nM
Kd
nM
EC50/IC50
nM
koff
s-1
kon
M-1s-1
pHTemp
°C
Microtubule-associated protein 2
(Homo sapiens (Human))
BDBM50234033
(CHEMBL4078213)
Show SMILES Clc1ccccc1OC[C@H]1CCCN1c1ncnc2[nH]cnc12 |r|
Show InChI InChI=1S/C16H16ClN5O/c17-12-5-1-2-6-13(12)23-8-11-4-3-7-22(11)16-14-15(19-9-18-14)20-10-21-16/h1-2,5-6,9-11H,3-4,7-8H2,(H,18,19,20,21)/t11-/m1/s1
n/an/a 1.00E+3n/an/an/an/an/an/a
Merck KGaA
Curated by ChEMBL
Assay Description
Inhibition of recombinant human N-terminal His tagged MetAP-2 using tripeptide Met-Ala-Ser as substrate preincubated for 15 mins followed by substrat...
Bioorg Med Chem Lett 27: 551-556 (2017)
BindingDB Entry DOI: 10.7270/Q2V98BB4