BDBM50234162 (6R,7S,7aS)-6-((R)-1-(3,5-bis(trifluoromethyl)phenyl)ethoxy)-7-(4-fluorophenyl)tetrahydro-1H-pyrrolizin-3(2H)-one::(6R,7S,7aS)-6-{(1R)-1-[3,5-bis(trifluoromethyl)phenyl]ethoxy}-7-(4-fluorophenyl)hexahydro-3H-pyrrolizin-3-one::CHEMBL272649
SMILES: C[C@@H](O[C@H]1CN2[C@@H](CCC2=O)[C@@H]1c1ccc(F)cc1)c1cc(cc(c1)C(F)(F)F)C(F)(F)F
InChI Key: InChIKey=SUITYIWBXSZXIQ-MJRZITLZSA-N
Data: 6 IC50
Activity Spreadsheet -- Enzyme Inhibition Constant Data from BindingDB
Found 6 hits for monomerid = 50234162
Trg + Lig
Ki
nM
ΔG°
kcal/mole
IC50
nM
Kd
nM
EC50/IC50
nM
koff
s-1
kon
M-1s-1
pHTemp
°C
Neurokinin 1 receptor
(Homo sapiens (Human))
BDBM50234162
((6R,7S,7aS)-6-((R)-1-(3,5-bis(trifluoromethyl)phen...)
Show SMILES C[C@@H](O[C@H]1CN2[C@@H](CCC2=O)[C@@H]1c1ccc(F)cc1)c1cc(cc(c1)C(F)(F)F)C(F)(F)F
Show InChI InChI=1S/C23H20F7NO2/c1-12(14-8-15(22(25,26)27)10-16(9-14)23(28,29)30)33-19-11-31-18(6-7-20(31)32)21(19)13-2-4-17(24)5-3-13/h2-5,8-10,12,18-19,21H,6-7,11H2,1H3/t12-,18+,19+,21+/m1/s1
Reactome pathway
n/an/a 0.0600n/an/an/an/an/an/a
Merck Research Laboratories
Curated by ChEMBL
Assay Description
Displacement of [125I]substance P from human NK1 receptor expressed in CHO cells
Bioorg Med Chem Lett 20: 2007-12 (2010)
Article DOI: 10.1016/j.bmcl.2010.01.065
BindingDB Entry DOI: 10.7270/Q23X86SP
Neurokinin 1 receptor
(Homo sapiens (Human))
BDBM50234162
((6R,7S,7aS)-6-((R)-1-(3,5-bis(trifluoromethyl)phen...)
Show SMILES C[C@@H](O[C@H]1CN2[C@@H](CCC2=O)[C@@H]1c1ccc(F)cc1)c1cc(cc(c1)C(F)(F)F)C(F)(F)F
Show InChI InChI=1S/C23H20F7NO2/c1-12(14-8-15(22(25,26)27)10-16(9-14)23(28,29)30)33-19-11-31-18(6-7-20(31)32)21(19)13-2-4-17(24)5-3-13/h2-5,8-10,12,18-19,21H,6-7,11H2,1H3/t12-,18+,19+,21+/m1/s1
Reactome pathway
n/an/a 2.20n/an/an/an/an/an/a
Merck Research Laboratories
Curated by ChEMBL
Assay Description
Displacement of [125I]substance P from human NK1 receptor expressed in CHO cells in the presence of 50 percent human serum
Bioorg Med Chem Lett 20: 2007-12 (2010)
Article DOI: 10.1016/j.bmcl.2010.01.065
BindingDB Entry DOI: 10.7270/Q23X86SP
Neurokinin 1 receptor
(Homo sapiens (Human))
BDBM50234162
((6R,7S,7aS)-6-((R)-1-(3,5-bis(trifluoromethyl)phen...)
Show SMILES C[C@@H](O[C@H]1CN2[C@@H](CCC2=O)[C@@H]1c1ccc(F)cc1)c1cc(cc(c1)C(F)(F)F)C(F)(F)F
Show InChI InChI=1S/C23H20F7NO2/c1-12(14-8-15(22(25,26)27)10-16(9-14)23(28,29)30)33-19-11-31-18(6-7-20(31)32)21(19)13-2-4-17(24)5-3-13/h2-5,8-10,12,18-19,21H,6-7,11H2,1H3/t12-,18+,19+,21+/m1/s1
Reactome pathway
n/an/a 0.0600n/an/an/an/an/an/a
Merck Research Laboratories
Curated by ChEMBL
Assay Description
Displacement of [125I]L-703606 from human NK1 expressed in CHO cells
Bioorg Med Chem 16: 2156-70 (2008)
Article DOI: 10.1016/j.bmc.2007.11.081
BindingDB Entry DOI: 10.7270/Q2BK1D6M
Neurokinin 1 receptor
(Homo sapiens (Human))
BDBM50234162
((6R,7S,7aS)-6-((R)-1-(3,5-bis(trifluoromethyl)phen...)
Show SMILES C[C@@H](O[C@H]1CN2[C@@H](CCC2=O)[C@@H]1c1ccc(F)cc1)c1cc(cc(c1)C(F)(F)F)C(F)(F)F
Show InChI InChI=1S/C23H20F7NO2/c1-12(14-8-15(22(25,26)27)10-16(9-14)23(28,29)30)33-19-11-31-18(6-7-20(31)32)21(19)13-2-4-17(24)5-3-13/h2-5,8-10,12,18-19,21H,6-7,11H2,1H3/t12-,18+,19+,21+/m1/s1
Reactome pathway
n/an/a 0.0600n/an/an/an/an/an/a
Merck Research Laboratories
Curated by ChEMBL
Assay Description
Displacement of [125I]substance P from human NK1 receptor expressed in CHO cells
Bioorg Med Chem Lett 20: 5925-32 (2010)
Article DOI: 10.1016/j.bmcl.2010.07.058
BindingDB Entry DOI: 10.7270/Q2668DFC
Pregnane X receptor
(Homo sapiens (Human))
BDBM50234162
((6R,7S,7aS)-6-((R)-1-(3,5-bis(trifluoromethyl)phen...)
Show SMILES C[C@@H](O[C@H]1CN2[C@@H](CCC2=O)[C@@H]1c1ccc(F)cc1)c1cc(cc(c1)C(F)(F)F)C(F)(F)F
Show InChI InChI=1S/C23H20F7NO2/c1-12(14-8-15(22(25,26)27)10-16(9-14)23(28,29)30)33-19-11-31-18(6-7-20(31)32)21(19)13-2-4-17(24)5-3-13/h2-5,8-10,12,18-19,21H,6-7,11H2,1H3/t12-,18+,19+,21+/m1/s1
n/an/a 4.80E+3n/an/an/an/an/an/a
Merck Research Laboratories
Curated by ChEMBL
Assay Description
Inhibition of human PXR induction
Bioorg Med Chem Lett 20: 5925-32 (2010)
Article DOI: 10.1016/j.bmcl.2010.07.058
BindingDB Entry DOI: 10.7270/Q2668DFC
Neurokinin 1 receptor
(Homo sapiens (Human))
BDBM50234162
((6R,7S,7aS)-6-((R)-1-(3,5-bis(trifluoromethyl)phen...)
Show SMILES C[C@@H](O[C@H]1CN2[C@@H](CCC2=O)[C@@H]1c1ccc(F)cc1)c1cc(cc(c1)C(F)(F)F)C(F)(F)F
Show InChI InChI=1S/C23H20F7NO2/c1-12(14-8-15(22(25,26)27)10-16(9-14)23(28,29)30)33-19-11-31-18(6-7-20(31)32)21(19)13-2-4-17(24)5-3-13/h2-5,8-10,12,18-19,21H,6-7,11H2,1H3/t12-,18+,19+,21+/m1/s1
Reactome pathway
n/an/a 2.20n/an/an/an/an/an/a
Merck Research Laboratories
Curated by ChEMBL
Assay Description
Displacement of [125I]substance P from human NK1 receptor expressed in CHO cells in presence of 50% human serum
Bioorg Med Chem Lett 20: 5925-32 (2010)
Article DOI: 10.1016/j.bmcl.2010.07.058
BindingDB Entry DOI: 10.7270/Q2668DFC