BDBM50234293 CHEMBL4069884
SMILES: CS(=O)(=O)N1CCC[C@@H](C1)c1csc(n1)-c1ccccc1NC(=O)c1ncc[nH]1
InChI Key: InChIKey=WSTBNDDBNXWHQU-ZDUSSCGKSA-N
Data: 1 IC50  1 EC50
Activity Spreadsheet -- Enzyme Inhibition Constant Data from BindingDB
Found 2 hits for monomerid = 50234293
Trg + Lig
Ki
nM
ΔG°
kcal/mole
IC50
nM
Kd
nM
EC50/IC50
nM
koff
s-1
kon
M-1s-1
pHTemp
°C
Tyrosine-protein kinase receptor UFO
(Homo sapiens (Human))
BDBM50234293
(CHEMBL4069884)
Show SMILES CS(=O)(=O)N1CCC[C@@H](C1)c1csc(n1)-c1ccccc1NC(=O)c1ncc[nH]1 |r|
Show InChI InChI=1S/C19H21N5O3S2/c1-29(26,27)24-10-4-5-13(11-24)16-12-28-19(23-16)14-6-2-3-7-15(14)22-18(25)17-20-8-9-21-17/h2-3,6-9,12-13H,4-5,10-11H2,1H3,(H,20,21)(H,22,25)/t13-/m0/s1
n/an/an/an/a 3.60E+3n/an/an/an/a
Takeda California
Curated by ChEMBL
Assay Description
Inhibition of Axl (unknown origin) phosphorylation expressed in HEK293 cells by ELISA
Bioorg Med Chem Lett 27: 1099-1104 (2017)
BindingDB Entry DOI: 10.7270/Q2D50Q6F
Tyrosine-protein kinase receptor UFO
(Homo sapiens (Human))
BDBM50234293
(CHEMBL4069884)
Show SMILES CS(=O)(=O)N1CCC[C@@H](C1)c1csc(n1)-c1ccccc1NC(=O)c1ncc[nH]1 |r|
Show InChI InChI=1S/C19H21N5O3S2/c1-29(26,27)24-10-4-5-13(11-24)16-12-28-19(23-16)14-6-2-3-7-15(14)22-18(25)17-20-8-9-21-17/h2-3,6-9,12-13H,4-5,10-11H2,1H3,(H,20,21)(H,22,25)/t13-/m0/s1
n/an/a 33n/an/an/an/an/an/a
Takeda California
Curated by ChEMBL
Assay Description
Inhibition of Axl (unknown origin)
Bioorg Med Chem Lett 27: 1099-1104 (2017)
BindingDB Entry DOI: 10.7270/Q2D50Q6F