BDBM50234303 CHEMBL4066616
SMILES: CS(=O)(=O)N1CCC[C@@H](C1)c1csc(n1)-c1cc(ccc1NC(=O)c1ncc[nH]1)N1CCOCC1
InChI Key: InChIKey=LQDVRJVSNWFSRK-INIZCTEOSA-N
Data: 1 IC50  1 EC50
Activity Spreadsheet -- Enzyme Inhibition Constant Data from BindingDB
Found 2 hits for monomerid = 50234303
Trg + Lig
Ki
nM
ΔG°
kcal/mole
IC50
nM
Kd
nM
EC50/IC50
nM
koff
s-1
kon
M-1s-1
pHTemp
°C
Tyrosine-protein kinase receptor UFO
(Homo sapiens (Human))
BDBM50234303
(CHEMBL4066616)
Show SMILES CS(=O)(=O)N1CCC[C@@H](C1)c1csc(n1)-c1cc(ccc1NC(=O)c1ncc[nH]1)N1CCOCC1 |r|
Show InChI InChI=1S/C23H28N6O4S2/c1-35(31,32)29-8-2-3-16(14-29)20-15-34-23(27-20)18-13-17(28-9-11-33-12-10-28)4-5-19(18)26-22(30)21-24-6-7-25-21/h4-7,13,15-16H,2-3,8-12,14H2,1H3,(H,24,25)(H,26,30)/t16-/m0/s1
n/an/an/an/a 15n/an/an/an/a
Takeda California
Curated by ChEMBL
Assay Description
Inhibition of Axl (unknown origin) phosphorylation expressed in HEK293 cells by ELISA
Bioorg Med Chem Lett 27: 1099-1104 (2017)
BindingDB Entry DOI: 10.7270/Q2D50Q6F
Tyrosine-protein kinase receptor UFO
(Homo sapiens (Human))
BDBM50234303
(CHEMBL4066616)
Show SMILES CS(=O)(=O)N1CCC[C@@H](C1)c1csc(n1)-c1cc(ccc1NC(=O)c1ncc[nH]1)N1CCOCC1 |r|
Show InChI InChI=1S/C23H28N6O4S2/c1-35(31,32)29-8-2-3-16(14-29)20-15-34-23(27-20)18-13-17(28-9-11-33-12-10-28)4-5-19(18)26-22(30)21-24-6-7-25-21/h4-7,13,15-16H,2-3,8-12,14H2,1H3,(H,24,25)(H,26,30)/t16-/m0/s1
n/an/a 3.40n/an/an/an/an/an/a
Takeda California
Curated by ChEMBL
Assay Description
Inhibition of Axl (unknown origin)
Bioorg Med Chem Lett 27: 1099-1104 (2017)
BindingDB Entry DOI: 10.7270/Q2D50Q6F