BDBM50234355 CHEMBL4084117
SMILES: CC(=O)c1nc(c(NCc2ccc(Cl)c(Cl)c2)s1)[N+]([O-])=O
InChI Key: InChIKey=FUFPOFJRUAOXRH-UHFFFAOYSA-N
Data: 1 IC50
Activity Spreadsheet -- Enzyme Inhibition Constant Data from BindingDB
Found 1 hit for monomerid = 50234355
Trg + Lig
Ki
nM
ΔG°
kcal/mole
IC50
nM
Kd
nM
EC50/IC50
nM
koff
s-1
kon
M-1s-1
pHTemp
°C
Ubiquitin carboxyl-terminal hydrolase 7
(Homo sapiens (Human))
BDBM50234355
(CHEMBL4084117)
Show SMILES CC(=O)c1nc(c(NCc2ccc(Cl)c(Cl)c2)s1)[N+]([O-])=O
Show InChI InChI=1S/C12H9Cl2N3O3S/c1-6(18)11-16-10(17(19)20)12(21-11)15-5-7-2-3-8(13)9(14)4-7/h2-4,15H,5H2,1H3
n/an/a>5.00E+4n/an/an/an/an/an/a
China Pharmaceutical University
Curated by ChEMBL
Assay Description
Inhibition of USP7 (unknown origin) using Ub-Rho as substrate preincubated for 30 mins followed by substrate addition and subsequent incubation in da...
Bioorg Med Chem Lett 27: 845-849 (2017)
BindingDB Entry DOI: 10.7270/Q20Z75HQ