null
SMILES: Cc1ccc(cc1S(=O)(=O)N1CCCCC1)C(=O)NC1CCCCC1
InChI Key: InChIKey=SJEJLXFLDJTETB-UHFFFAOYSA-N
Activity Spreadsheet -- Enzyme Inhibition Constant Data from BindingDB
Found 1 hit for monomerid = 50234383
Trg + Lig
Ki
nM
ΔG°
kcal/mole
IC50
nM
Kd
nM
EC50/IC50
nM
koff
s-1
kon
M-1s-1
pHTemp
°C
Cannabinoid receptor 2
(Homo sapiens (Human))
BDBM50234383
(CHEMBL252859 | N-cyclohexyl-4-methyl-3-(piperidin-...)
Show SMILES Cc1ccc(cc1S(=O)(=O)N1CCCCC1)C(=O)NC1CCCCC1
Show InChI InChI=1S/C19H28N2O3S/c1-15-10-11-16(19(22)20-17-8-4-2-5-9-17)14-18(15)25(23,24)21-12-6-3-7-13-21/h10-11,14,17H,2-9,12-13H2,1H3,(H,20,22)
Reactome pathway
n/an/an/an/a 14n/an/an/an/a
Evotec (UK) Ltd.
Curated by ChEMBL
Assay Description
Agonist activity at human CB2 receptor expressed in CHO cells assessed as inhibition of forskolin-stimulated cAMP level
Bioorg Med Chem Lett 18: 1725-9 (2008)
Article DOI: 10.1016/j.bmcl.2008.01.042
BindingDB Entry DOI: 10.7270/Q2X92B1F