null
SMILES: Cc1ccc(cc1S(=O)(=O)N1CCCCC1)C(=O)Nc1ccccc1C(F)(F)F
InChI Key: InChIKey=QHLUJWDFVXVLJV-UHFFFAOYSA-N
Activity Spreadsheet -- Enzyme Inhibition Constant Data from BindingDB
Found 1 hit for monomerid = 50234384
Trg + Lig
Ki
nM
ΔG°
kcal/mole
IC50
nM
Kd
nM
EC50/IC50
nM
koff
s-1
kon
M-1s-1
pHTemp
°C
Cannabinoid receptor 2
(Homo sapiens (Human))
BDBM50234384
(4-methyl-3-(piperidin-1-ylsulfonyl)-N-(2-(trifluor...)
Show SMILES Cc1ccc(cc1S(=O)(=O)N1CCCCC1)C(=O)Nc1ccccc1C(F)(F)F
Show InChI InChI=1S/C20H21F3N2O3S/c1-14-9-10-15(13-18(14)29(27,28)25-11-5-2-6-12-25)19(26)24-17-8-4-3-7-16(17)20(21,22)23/h3-4,7-10,13H,2,5-6,11-12H2,1H3,(H,24,26)
Reactome pathway
n/an/an/an/a 2n/an/an/an/a
Evotec (UK) Ltd.
Curated by ChEMBL
Assay Description
Agonist activity at human CB2 receptor expressed in CHO cells assessed as inhibition of forskolin-stimulated cAMP level
Bioorg Med Chem Lett 18: 1725-9 (2008)
Article DOI: 10.1016/j.bmcl.2008.01.042
BindingDB Entry DOI: 10.7270/Q2X92B1F