null
SMILES: Cc1ccc(cc1S(=O)(=O)N1CCC(O)CC1)C(=O)N1CCC2CCCCC2C1
InChI Key: InChIKey=OEGCGEQYCKTJHY-UHFFFAOYSA-N
Activity Spreadsheet -- Enzyme Inhibition Constant Data from BindingDB
Found 1 hit for monomerid = 50234405
Trg + Lig
Ki
nM
ΔG°
kcal/mole
IC50
nM
Kd
nM
EC50/IC50
nM
koff
s-1
kon
M-1s-1
pHTemp
°C
Cannabinoid receptor 2
(Homo sapiens (Human))
BDBM50234405
((3-(4-hydroxypiperidin-1-ylsulfonyl)-4-methylpheny...)
Show SMILES Cc1ccc(cc1S(=O)(=O)N1CCC(O)CC1)C(=O)N1CCC2CCCCC2C1 |w:22.23,27.30|
Show InChI InChI=1S/C22H32N2O4S/c1-16-6-7-18(14-21(16)29(27,28)24-12-9-20(25)10-13-24)22(26)23-11-8-17-4-2-3-5-19(17)15-23/h6-7,14,17,19-20,25H,2-5,8-13,15H2,1H3
Reactome pathway
n/an/an/an/a 215n/an/an/an/a
Evotec (UK) Ltd.
Curated by ChEMBL
Assay Description
Agonist activity at human CB2 receptor expressed in CHO cells assessed as inhibition of forskolin-stimulated cAMP level
Bioorg Med Chem Lett 18: 1725-9 (2008)
Article DOI: 10.1016/j.bmcl.2008.01.042
BindingDB Entry DOI: 10.7270/Q2X92B1F