BDBM50234408 CHEMBL253462::N-(3-chlorophenyl)-4-methyl-3-(piperidin-1-ylsulfonyl)benzamide
SMILES: Cc1ccc(cc1S(=O)(=O)N1CCCCC1)C(=O)Nc1cccc(Cl)c1
InChI Key: InChIKey=OZGMDLMBOCCJJC-UHFFFAOYSA-N
Data: 1 EC50
Activity Spreadsheet -- Enzyme Inhibition Constant Data from BindingDB
Found 1 hit for monomerid = 50234408
Trg + Lig
Ki
nM
ΔG°
kcal/mole
IC50
nM
Kd
nM
EC50/IC50
nM
koff
s-1
kon
M-1s-1
pHTemp
°C
Cannabinoid receptor 2
(Homo sapiens (Human))
BDBM50234408
(CHEMBL253462 | N-(3-chlorophenyl)-4-methyl-3-(pipe...)
Show SMILES Cc1ccc(cc1S(=O)(=O)N1CCCCC1)C(=O)Nc1cccc(Cl)c1
Show InChI InChI=1S/C19H21ClN2O3S/c1-14-8-9-15(19(23)21-17-7-5-6-16(20)13-17)12-18(14)26(24,25)22-10-3-2-4-11-22/h5-9,12-13H,2-4,10-11H2,1H3,(H,21,23)
Reactome pathway
n/an/an/an/a 27n/an/an/an/a
Evotec (UK) Ltd.
Curated by ChEMBL
Assay Description
Agonist activity at human CB2 receptor expressed in CHO cells assessed as inhibition of forskolin-stimulated cAMP level
Bioorg Med Chem Lett 18: 1725-9 (2008)
Article DOI: 10.1016/j.bmcl.2008.01.042
BindingDB Entry DOI: 10.7270/Q2X92B1F