BDBM50234417 CHEMBL254730::N-cyclohexyl-4-isopropyl-3-(pyrrolidin-1-ylsulfonyl)benzamide
SMILES: CC(C)c1ccc(cc1S(=O)(=O)N1CCCC1)C(=O)NC1CCCCC1
InChI Key: InChIKey=HHHWGIGAXIQAKD-UHFFFAOYSA-N
Data: 1 EC50
Activity Spreadsheet -- Enzyme Inhibition Constant Data from BindingDB
Found 1 hit for monomerid = 50234417
Trg + Lig
Ki
nM
ΔG°
kcal/mole
IC50
nM
Kd
nM
EC50/IC50
nM
koff
s-1
kon
M-1s-1
pHTemp
°C
Cannabinoid receptor 2
(Homo sapiens (Human))
BDBM50234417
(CHEMBL254730 | N-cyclohexyl-4-isopropyl-3-(pyrroli...)
Show SMILES CC(C)c1ccc(cc1S(=O)(=O)N1CCCC1)C(=O)NC1CCCCC1
Show InChI InChI=1S/C20H30N2O3S/c1-15(2)18-11-10-16(20(23)21-17-8-4-3-5-9-17)14-19(18)26(24,25)22-12-6-7-13-22/h10-11,14-15,17H,3-9,12-13H2,1-2H3,(H,21,23)
Reactome pathway
n/an/an/an/a 4n/an/an/an/a
Evotec (UK) Ltd.
Curated by ChEMBL
Assay Description
Agonist activity at human CB2 receptor expressed in CHO cells assessed as inhibition of forskolin-stimulated cAMP level
Bioorg Med Chem Lett 18: 1725-9 (2008)
Article DOI: 10.1016/j.bmcl.2008.01.042
BindingDB Entry DOI: 10.7270/Q2X92B1F