BDBM50234420 5-(decahydroisoquinoline-2-carbonyl)-2-methyl-N-phenylbenzenesulfonamide::CHEMBL402155
SMILES: Cc1ccc(cc1S(=O)(=O)Nc1ccccc1)C(=O)N1CCC2CCCCC2C1
InChI Key: InChIKey=PWIBKEWBERRHGJ-UHFFFAOYSA-N
Data: 1 EC50
Activity Spreadsheet -- Enzyme Inhibition Constant Data from BindingDB
Found 1 hit for monomerid = 50234420
Trg + Lig
Ki
nM
ΔG°
kcal/mole
IC50
nM
Kd
nM
EC50/IC50
nM
koff
s-1
kon
M-1s-1
pHTemp
°C
Cannabinoid receptor 2
(Homo sapiens (Human))
BDBM50234420
(5-(decahydroisoquinoline-2-carbonyl)-2-methyl-N-ph...)
Show SMILES Cc1ccc(cc1S(=O)(=O)Nc1ccccc1)C(=O)N1CCC2CCCCC2C1 |w:22.23,27.30|
Show InChI InChI=1S/C23H28N2O3S/c1-17-11-12-19(15-22(17)29(27,28)24-21-9-3-2-4-10-21)23(26)25-14-13-18-7-5-6-8-20(18)16-25/h2-4,9-12,15,18,20,24H,5-8,13-14,16H2,1H3
Reactome pathway
n/an/an/an/a>2.00E+4n/an/an/an/a
Evotec (UK) Ltd.
Curated by ChEMBL
Assay Description
Agonist activity at human CB2 receptor expressed in CHO cells assessed as inhibition of forskolin-stimulated cAMP level
Bioorg Med Chem Lett 18: 1725-9 (2008)
Article DOI: 10.1016/j.bmcl.2008.01.042
BindingDB Entry DOI: 10.7270/Q2X92B1F