null
SMILES: COc1ccc(Cn2c(-c3ccc(C)cc3)c(-c3ccc(cc3)C(F)(F)F)c(=O)c3cc(ccc23)[N+]([O-])=O)cc1
InChI Key: InChIKey=VFQYVQUXCRDQRC-UHFFFAOYSA-N
Activity Spreadsheet -- Enzyme Inhibition Constant Data from BindingDB
Found 2 hits for monomerid = 50234705
Trg + Lig
Ki
nM
ΔG°
kcal/mole
IC50
nM
Kd
nM
EC50/IC50
nM
koff
s-1
kon
M-1s-1
pHTemp
°C
Intestinal-type alkaline phosphatase
(Bos taurus (Cattle))
BDBM50234705
(CHEMBL4062042)
Show SMILES COc1ccc(Cn2c(-c3ccc(C)cc3)c(-c3ccc(cc3)C(F)(F)F)c(=O)c3cc(ccc23)[N+]([O-])=O)cc1
Show InChI InChI=1S/C31H23F3N2O4/c1-19-3-7-22(8-4-19)29-28(21-9-11-23(12-10-21)31(32,33)34)30(37)26-17-24(36(38)39)13-16-27(26)35(29)18-20-5-14-25(40-2)15-6-20/h3-17H,18H2,1-2H3
n/an/a 8.34E+3n/an/an/an/an/an/a
Universit£t Rostock
Curated by ChEMBL
Assay Description
Inhibition of calf intestinal alkaline phosphatase using CDP-star as substrate preincubated for 5 to 7 mins followed by substrate addition measured a...
Eur J Med Chem 126: 408-420 (2017)
BindingDB Entry DOI: 10.7270/Q2DZ0BKR
Alkaline phosphatase, tissue-nonspecific isozyme
(Bos taurus (Cattle))
BDBM50234705
(CHEMBL4062042)
Show SMILES COc1ccc(Cn2c(-c3ccc(C)cc3)c(-c3ccc(cc3)C(F)(F)F)c(=O)c3cc(ccc23)[N+]([O-])=O)cc1
Show InChI InChI=1S/C31H23F3N2O4/c1-19-3-7-22(8-4-19)29-28(21-9-11-23(12-10-21)31(32,33)34)30(37)26-17-24(36(38)39)13-16-27(26)35(29)18-20-5-14-25(40-2)15-6-20/h3-17H,18H2,1-2H3
n/an/a 6.19E+3n/an/an/an/an/an/a
Universit£t Rostock
Curated by ChEMBL
Assay Description
Inhibition of bovine TNAP using CDP-star as substrate preincubated for 5 to 7 mins followed by substrate addition measured after 15 mins by spectroph...
Eur J Med Chem 126: 408-420 (2017)
BindingDB Entry DOI: 10.7270/Q2DZ0BKR