BDBM50234713 CHEMBL4077772
SMILES: Cc1ccc(cc1)-c1[nH]c2ccc(cc2c(=O)c1-c1ccc(cc1)C(F)(F)F)[N+]([O-])=O
InChI Key: InChIKey=MUANCYDZXSNIHY-UHFFFAOYSA-N
Data: 2 IC50
Activity Spreadsheet -- Enzyme Inhibition Constant Data from BindingDB
Found 2 hits for monomerid = 50234713
Trg + Lig
Ki
nM
ΔG°
kcal/mole
IC50
nM
Kd
nM
EC50/IC50
nM
koff
s-1
kon
M-1s-1
pHTemp
°C
Intestinal alkaline phosphatase
(Bos taurus (Cattle))
BDBM50234713
(CHEMBL4077772)
Show SMILES Cc1ccc(cc1)-c1[nH]c2ccc(cc2c(=O)c1-c1ccc(cc1)C(F)(F)F)[N+]([O-])=O
Show InChI InChI=1S/C23H15F3N2O3/c1-13-2-4-15(5-3-13)21-20(14-6-8-16(9-7-14)23(24,25)26)22(29)18-12-17(28(30)31)10-11-19(18)27-21/h2-12H,1H3,(H,27,29)
n/an/a 4.38E+3n/an/an/an/an/an/a
Universit£t Rostock
Curated by ChEMBL
Assay Description
Inhibition of calf intestinal alkaline phosphatase using CDP-star as substrate preincubated for 5 to 7 mins followed by substrate addition measured a...
Eur J Med Chem 126: 408-420 (2017)
BindingDB Entry DOI: 10.7270/Q2DZ0BKR
Tissue non-specific alkaline phosphatase (TNAP)
(Bos taurus (Cattle))
BDBM50234713
(CHEMBL4077772)
Show SMILES Cc1ccc(cc1)-c1[nH]c2ccc(cc2c(=O)c1-c1ccc(cc1)C(F)(F)F)[N+]([O-])=O
Show InChI InChI=1S/C23H15F3N2O3/c1-13-2-4-15(5-3-13)21-20(14-6-8-16(9-7-14)23(24,25)26)22(29)18-12-17(28(30)31)10-11-19(18)27-21/h2-12H,1H3,(H,27,29)
n/an/a 2.69E+3n/an/an/an/an/an/a
Universit£t Rostock
Curated by ChEMBL
Assay Description
Inhibition of bovine TNAP using CDP-star as substrate preincubated for 5 to 7 mins followed by substrate addition measured after 15 mins by spectroph...
Eur J Med Chem 126: 408-420 (2017)
BindingDB Entry DOI: 10.7270/Q2DZ0BKR