BDBM50234726 (3,5-dichloropyridin-4-yl)(4-methyl-4-(4-(phenyl(pyridin-3-yl)amino)piperidin-1-yl)piperidin-1-yl)methanone::CHEMBL255644
SMILES: CC1(CCN(CC1)C(=O)c1c(Cl)cncc1Cl)N1CCC(CC1)N(c1ccccc1)c1cccnc1
InChI Key: InChIKey=NEWOCKYIUSCKBX-UHFFFAOYSA-N
Data: 3 IC50
Activity Spreadsheet -- Enzyme Inhibition Constant Data from BindingDB
Found 3 hits for monomerid = 50234726
Trg + Lig
Ki
nM
ΔG°
kcal/mole
IC50
nM
Kd
nM
EC50/IC50
nM
koff
s-1
kon
M-1s-1
pHTemp
°C
Potassium voltage-gated channel subfamily H member 2
(Homo sapiens (Human))
BDBM50234726
((3,5-dichloropyridin-4-yl)(4-methyl-4-(4-(phenyl(p...)
Show SMILES CC1(CCN(CC1)C(=O)c1c(Cl)cncc1Cl)N1CCC(CC1)N(c1ccccc1)c1cccnc1
Show InChI InChI=1S/C28H31Cl2N5O/c1-28(11-16-33(17-12-28)27(36)26-24(29)19-32-20-25(26)30)34-14-9-22(10-15-34)35(21-6-3-2-4-7-21)23-8-5-13-31-18-23/h2-8,13,18-20,22H,9-12,14-17H2,1H3
Reactome pathway
n/an/a 2.00E+3n/an/an/an/an/an/a
Novartis Institutes for BioMedical Research
Curated by ChEMBL
Assay Description
Displacement of [3H]dofetilide from human ERG expressed in HEK293 cell membranes
Bioorg Med Chem Lett 18: 2000-5 (2008)
Article DOI: 10.1016/j.bmcl.2008.01.108
BindingDB Entry DOI: 10.7270/Q2NC6229
C-C chemokine receptor type 5
(Macaca fascicularis)
BDBM50234726
((3,5-dichloropyridin-4-yl)(4-methyl-4-(4-(phenyl(p...)
Show SMILES CC1(CCN(CC1)C(=O)c1c(Cl)cncc1Cl)N1CCC(CC1)N(c1ccccc1)c1cccnc1
Show InChI InChI=1S/C28H31Cl2N5O/c1-28(11-16-33(17-12-28)27(36)26-24(29)19-32-20-25(26)30)34-14-9-22(10-15-34)35(21-6-3-2-4-7-21)23-8-5-13-31-18-23/h2-8,13,18-20,22H,9-12,14-17H2,1H3
n/an/a 3.20n/an/an/an/an/an/a
Novartis Institutes for BioMedical Research
Curated by ChEMBL
Assay Description
Displacement of radiolabeled MIP-1alpha from cynomolgus monkey CCR5 expressed in CHO cells
Bioorg Med Chem Lett 18: 2000-5 (2008)
Article DOI: 10.1016/j.bmcl.2008.01.108
BindingDB Entry DOI: 10.7270/Q2NC6229
C-C chemokine receptor type 5
(Homo sapiens (Human))
BDBM50234726
((3,5-dichloropyridin-4-yl)(4-methyl-4-(4-(phenyl(p...)
Show SMILES CC1(CCN(CC1)C(=O)c1c(Cl)cncc1Cl)N1CCC(CC1)N(c1ccccc1)c1cccnc1
Show InChI InChI=1S/C28H31Cl2N5O/c1-28(11-16-33(17-12-28)27(36)26-24(29)19-32-20-25(26)30)34-14-9-22(10-15-34)35(21-6-3-2-4-7-21)23-8-5-13-31-18-23/h2-8,13,18-20,22H,9-12,14-17H2,1H3
n/an/a 0.800n/an/an/an/an/an/a
Novartis Institutes for BioMedical Research
Curated by ChEMBL
Assay Description
Displacement of [125I]RANTES from human CCR5 expressed in CHO cells
Bioorg Med Chem Lett 18: 2000-5 (2008)
Article DOI: 10.1016/j.bmcl.2008.01.108
BindingDB Entry DOI: 10.7270/Q2NC6229