BDBM50234904 CHEMBL4086057
SMILES: CCc1cc(O)ccc1-c1ccc2c(n[nH]c2c1)-c1ncc[nH]1
InChI Key: InChIKey=HOKZBBUPCLVJDU-UHFFFAOYSA-N
Data: 4 IC50
Activity Spreadsheet -- Enzyme Inhibition Constant Data from BindingDB
Found 4 hits for monomerid = 50234904
Trg + Lig
Ki
nM
ΔG°
kcal/mole
IC50
nM
Kd
nM
EC50/IC50
nM
koff
s-1
kon
M-1s-1
pHTemp
°C
Tyrosine-protein kinase JAK1
(Homo sapiens (Human))
BDBM50234904
(CHEMBL4086057)
Show SMILES CCc1cc(O)ccc1-c1ccc2c(n[nH]c2c1)-c1ncc[nH]1
Show InChI InChI=1S/C18H16N4O/c1-2-11-9-13(23)4-6-14(11)12-3-5-15-16(10-12)21-22-17(15)18-19-7-8-20-18/h3-10,23H,2H2,1H3,(H,19,20)(H,21,22)
Reactome pathway
n/an/a 0.900n/an/an/an/an/an/a
Pfizer Inc.
Curated by ChEMBL
Assay Description
Inhibition of GST tagged human recombinant JAK1 catalytic domain expressed in baculovirus using peptide substrate preincubated for 60 mins followed b...
J Med Chem 60: 767-786 (2017)
BindingDB Entry DOI: 10.7270/Q24J0HDZ
Non-receptor tyrosine-protein kinase TYK2
(Homo sapiens (Human))
BDBM50234904
(CHEMBL4086057)
Show SMILES CCc1cc(O)ccc1-c1ccc2c(n[nH]c2c1)-c1ncc[nH]1
Show InChI InChI=1S/C18H16N4O/c1-2-11-9-13(23)4-6-14(11)12-3-5-15-16(10-12)21-22-17(15)18-19-7-8-20-18/h3-10,23H,2H2,1H3,(H,19,20)(H,21,22)
n/an/a 4.60n/an/an/an/an/an/a
Pfizer Inc.
Curated by ChEMBL
Assay Description
Inhibition of Tyk2 (unknown origin) using peptide substrate preincubated for 60 mins followed by substrate addition and measured after 60 mins by mic...
J Med Chem 60: 767-786 (2017)
BindingDB Entry DOI: 10.7270/Q24J0HDZ
Tyrosine-protein kinase JAK3
(Homo sapiens (Human))
BDBM50234904
(CHEMBL4086057)
Show SMILES CCc1cc(O)ccc1-c1ccc2c(n[nH]c2c1)-c1ncc[nH]1
Show InChI InChI=1S/C18H16N4O/c1-2-11-9-13(23)4-6-14(11)12-3-5-15-16(10-12)21-22-17(15)18-19-7-8-20-18/h3-10,23H,2H2,1H3,(H,19,20)(H,21,22)
Reactome pathway
n/an/a 0.800n/an/an/an/an/an/a
Pfizer Inc.
Curated by ChEMBL
Assay Description
Inhibition of GST tagged human recombinant JAK3 catalytic domain expressed in baculovirus using peptide substrate preincubated for 60 mins followed b...
J Med Chem 60: 767-786 (2017)
BindingDB Entry DOI: 10.7270/Q24J0HDZ
Tyrosine-protein kinase JAK2
(Homo sapiens (Human))
BDBM50234904
(CHEMBL4086057)
Show SMILES CCc1cc(O)ccc1-c1ccc2c(n[nH]c2c1)-c1ncc[nH]1
Show InChI InChI=1S/C18H16N4O/c1-2-11-9-13(23)4-6-14(11)12-3-5-15-16(10-12)21-22-17(15)18-19-7-8-20-18/h3-10,23H,2H2,1H3,(H,19,20)(H,21,22)
Reactome pathway
n/an/a 0.800n/an/an/an/an/an/a
Pfizer Inc.
Curated by ChEMBL
Assay Description
Inhibition of GST tagged human recombinant JAK2 catalytic domain expressed in baculovirus using peptide substrate preincubated for 60 mins followed b...
J Med Chem 60: 767-786 (2017)
BindingDB Entry DOI: 10.7270/Q24J0HDZ