BDBM50234933 CHEMBL4085471
SMILES: Cn1ncc(NCc2ccc(F)cc2)c(Cl)c1=O
InChI Key: InChIKey=ADXCIGXMTGZCKB-UHFFFAOYSA-N
Data: 1 IC50
Activity Spreadsheet -- Enzyme Inhibition Constant Data from BindingDB
Found 1 hit for monomerid = 50234933
Trg + Lig
Ki
nM
ΔG°
kcal/mole
IC50
nM
Kd
nM
EC50/IC50
nM
koff
s-1
kon
M-1s-1
pHTemp
°C
Histone acetyltransferase KAT2A/KAT2B
(Homo sapiens (Human))
BDBM50234933
(CHEMBL4085471)
Show SMILES Cn1ncc(NCc2ccc(F)cc2)c(Cl)c1=O
Show InChI InChI=1S/C12H11ClFN3O/c1-17-12(18)11(13)10(7-16-17)15-6-8-2-4-9(14)5-3-8/h2-5,7,15H,6H2,1H3
NCI pathway
Reactome pathway
n/an/a 1.58E+4n/an/an/an/an/an/a
GlaxoSmithKline
Curated by ChEMBL
Assay Description
Displacement of GSK3103956A from FLAG-6 His-Halo tagged human PCAF bromodomain (715 to 831 residues) incubated for 30 mins in dark by TR-FRET assay
J Med Chem 60: 695-709 (2017)
BindingDB Entry DOI: 10.7270/Q2W09863