BDBM50234946 CHEMBL4083019
SMILES: CN1C[C@@H](C[C@H](C1)c1ccccc1)Nc1cnn(C)c(=O)c1Cl
InChI Key: InChIKey=ZJYJXUJUQQPMJB-ZIAGYGMSSA-N
Data: 1 IC50
Activity Spreadsheet -- Enzyme Inhibition Constant Data from BindingDB
Found 1 hit for monomerid = 50234946
Trg + Lig
Ki
nM
ΔG°
kcal/mole
IC50
nM
Kd
nM
EC50/IC50
nM
koff
s-1
kon
M-1s-1
pHTemp
°C
Histone acetyltransferase KAT2A/KAT2B
(Homo sapiens (Human))
BDBM50234946
(CHEMBL4083019)
Show SMILES CN1C[C@@H](C[C@H](C1)c1ccccc1)Nc1cnn(C)c(=O)c1Cl |r|
Show InChI InChI=1S/C17H21ClN4O/c1-21-10-13(12-6-4-3-5-7-12)8-14(11-21)20-15-9-19-22(2)17(23)16(15)18/h3-7,9,13-14,20H,8,10-11H2,1-2H3/t13-,14-/m1/s1
NCI pathway
Reactome pathway
n/an/a 3.98E+4n/an/an/an/an/an/a
GlaxoSmithKline
Curated by ChEMBL
Assay Description
Displacement of GSK3103956A from FLAG-6 His-Halo tagged human PCAF bromodomain (715 to 831 residues) incubated for 30 mins in dark by TR-FRET assay
J Med Chem 60: 695-709 (2017)
BindingDB Entry DOI: 10.7270/Q2W09863