BDBM50235145 CHEMBL3343919
SMILES: [H][C@@]1(CC[C@@]2(C)[C@@]([H])(CC[C@]3(C)[C@]2([H])CC=C2[C@]4([H])CC(C)(C)CC[C@@]4(CC[C@@]32C)C(=O)O[C@@H]2O[C@H](CO)[C@@H](O)[C@H](O)[C@H]2O)C1(C)C)O[C@@H]1O[C@H](CO)[C@@H](O)[C@H](O)[C@H]1O
InChI Key: InChIKey=LKYABSOYLMWGQR-WLMDKFIXSA-N
Data: 1 IC50
Activity Spreadsheet -- Enzyme Inhibition Constant Data from BindingDB
Found 1 hit for monomerid = 50235145
Trg + Lig
Ki
nM
ΔG°
kcal/mole
IC50
nM
Kd
nM
EC50/IC50
nM
koff
s-1
kon
M-1s-1
pHTemp
°C
Coagulation factor VII/tissue factor
(Homo sapiens (Human))
BDBM50235145
(CHEMBL3343919)
Show SMILES [H][C@@]1(CC[C@@]2(C)[C@@]([H])(CC[C@]3(C)[C@]2([H])CC=C2[C@]4([H])CC(C)(C)CC[C@@]4(CC[C@@]32C)C(=O)O[C@@H]2O[C@H](CO)[C@@H](O)[C@H](O)[C@H]2O)C1(C)C)O[C@@H]1O[C@H](CO)[C@@H](O)[C@H](O)[C@H]1O |r,t:16|
Show InChI InChI=1S/C42H68O13/c1-37(2)14-16-42(36(51)55-35-33(50)31(48)29(46)24(20-44)53-35)17-15-40(6)21(22(42)18-37)8-9-26-39(5)12-11-27(38(3,4)25(39)10-13-41(26,40)7)54-34-32(49)30(47)28(45)23(19-43)52-34/h8,22-35,43-50H,9-20H2,1-7H3/t22-,23+,24+,25-,26+,27-,28+,29+,30-,31-,32+,33+,34-,35-,39-,40+,41+,42-/m0/s1
Reactome pathway
n/an/a 16n/an/an/an/an/an/a
China Pharmaceutical University
Curated by ChEMBL
Assay Description
Inhibition of LPS-induced tissue factor procoagulant activity in human THP1 cells preincubated for 1 hr followed by LPS addition measured after 5 hrs...
Bioorg Med Chem Lett 27: 1026-1030 (2017)
Article DOI: 10.1016/j.bmcl.2016.12.066
BindingDB Entry DOI: 10.7270/Q2B27XJD